{"text_format":"1","workbook":"xlsx","n_sheets":44,"sheets":["00 Alimenta","00 Aggregatore","00 CE","Tab 50-51","Dettaglio voce AA0280","Tab 52","Tab 52bis","Tab 53","Tab 54","Tab 55","Tab 56-57","AB01-02-03","Tab. 57bis","Tab 58","Tab 58 bis","Tab 59-60","Farmaceutica Convenzionata","AS01-AS02","Tab 60-bis","Tab 61","Tab 61bis","AS03","AS04","Tab 62","Tab 63","Tab 64-65","Tab 66-67-68-69","Personale in Comando","Personale Universitario","Altro Contratto","Personale - Conto annuale","Tabella 2 Consuntivo","Riconciliazione Tabella 2 vs CE","Fondi CCNL - Consistenza","Fondi CCNL - Serie Storica","Tab 71","Punto 23","Commento Accantonamenti","Punti 24-25","Punto 26","PS02-03-04-05","PS06","PS07","Foglio1"],"not_rendered":{"charts":0,"images":0,"macros":0,"external_links":0,"defined_names":19,"comments":0,"pivot_tables":0},"unopened":[],"bounds":{"document_bytes":16777216,"sheet_cells":100000,"rows_first":2000,"rows_last":500,"rows_between":2000,"halvings":0,"cell_chars":16384,"cell_head_chars":4096},"cells_cut":0,"cells_raw":0,"read":"whole","date_system":"1900"}

{"sheet":"00 Alimenta","index":0,"n_rows":580,"n_cols":5,"rows_kept":580,"cut":false,"hidden":true,"merged":[]}
[]
["PRG",4]
[]
["CE","Conto","Descrizione conto","Esercizio 2016","Esercizio 2017"]
["AA0030","0301010101","Contributi da Regione F.S. regionale indistinto per quota capitaria",536774342.82999998,535837429.24000001]
["AA0030","0301010102","Contributi da Regione F.S. regionale indistinto per funzioni",9609333.7200000007,11928457.369999999]
["AA0040","0301010212","Quota per progetti di PSN L. 662/96",6083618.0599999996,14815465.59]
["AA0070","0301020101","Contributi da Regione (extra fondo) vincolati",180605.96,123104.1]
["AA0130","0301020202","Contributi da Aziende sanitarie pubbliche della Regione (extra fondo) altro",232003.28,0]
["AA0150","0301020306","Contributi da altri enti pubblici - vincolati",70020.75,156684.25]
["AA0200","0301030201","Contributi da Ministero della Salute per ricerca finalizzata",10216,0]
["AA0250","0716010101","Rettifica contributi in c/esercizio per destinazione ad investimenti - da Regione per quota F.S. regionale",-8787559.1099999994,-6506318.8899999997]
["AA0280","0302010102","Utilizzo fondi per quote inutilizzate contributi di esercizi precedenti da Regione per quota emersione extracomunitari L. 102/09 art. 1 ter, comma 17 e D.Lgs. 109/2012 art. 5, comma 16",697057.43,0]
["AA0280","0302010103","Utilizzo fondi per quote inutilizzate contributi di esercizi precedenti da Regione per quota medicina Penitenziaria D.Lgs 230/99",0,94584]
["AA0280","0302010104","Utilizzo fondi per quote inutilizzate contributi di esercizi precedenti per quota Medicina Penitenziaria art. 2 comma 283 L. 244/07",1616252.47,609546.18000000005]
["AA0280","0302010105","Utilizzo fondi per quote inutilizzate contributi di esercizi precedenti da Regione per quota hanseniani L. 31/86",17304.98,0]
["AA0280","0302010107","Utilizzo fondi per quote inutilizzate contributi di esercizi precedenti da Regione per quota Extracomunitari irregolari L. 40/98",45654.83,280768.86]
["AA0280","0302010111","Utilizzo fondi per quote inutilizzate contributi di esercizi precedenti da Regione per quota Aids L 135/90",375213.89,0]
["AA0280","0302010112","Utilizzo fondi per quote inutilizzate contributi di esercizi precedenti da Regione per quota Progetti di PSN L 662/96",3209444.23,4696121.0599999996]
["AA0280","0302010114","Utilizzo fondi per quote inutilizzate contrib. di es. prec. da Regione per accertamenti medico-legali disposti dalle AA.PP per dipendenti assenti dal servizio per malattia (art.2, co38, D.L.225/10)",0,0]
["AA0290","0302020101","Utilizzo fondi per quote inutilizzate contributi di esercizi precedenti da soggetti pubblici (extra fondo) vincolati",299262.65000000002,92452.46]
["AA0350","0303010101","Prestazioni di ricovero",29211073.789999999,30585746.350000001]
["AA0350","0303010102","Per assistenza ospedaliera (erogate da privato accreditato)",31064729.260000002,31524190.960000001]
["AA0360","0303010103","Prestazioni di specialistica ambulatoriale",5574849.6600000001,5751324.0899999999]
["AA0360","0303010105","Per altra assistenza specialistica ambulatoriale (erogate da privato accreditato)",2210077.16,2437190.17]
["AA0370","0303010107","Prestazioni di psichiatria residenziale e semiresidenziale nelle Strutture Psicoriabilitative (erogate da privato accreditato)",4761138.87,4556497.3099999996]
["AA0380","0303010108","Prestazioni di File F",13121092.029999999,13565690.02]
["AA0390","0303010109","Prestazioni servizi MMG, PLS, Continuità assistenziale",204670,57455.65]
["AA0400","0303010110","Prestazioni servizi farmaceutica convenzionata",1545791.88,1531007.26]
["AA0410","0303010112","per assistenza termale (erogate da privato accreditato)",1144807.45,1104099.8899999999]
["AA0420","0303010113","Prestazioni trasporto ambulanze ed elisoccorso",202243.79,175653.51]
["AA0430","0303010118","Per assistenza riabilitativa schema tipo previsto ex art. 26  L. 833/78 ",3391939.12,3470706.26]
["AA0430","0303010119","Per prestazioni ad anziani non autosufficienti nei Centri Residenziali",112156.53,151334.26999999999]
["AA0430","0303010120","Per prestazioni ad anziani non autosufficienti nelle Residenze Sanitarie Assistite",1701102.99,1770163.85]
["AA0440","0303010203","Altre prestazioni sanitarie e sociosanitarie a rilevanza sanitaria erogate ad altri soggetti pubblici",40778.15,45364.98]
["AA0460","0303010301","Prestazioni di ricovero",6326378.1500000004,1554681.22]
["AA0470","0303010302","Prestazioni ambulatoriali",1809228.39,851774.85]
["AA0490","0303010304","Prestazioni di File F",972613.7,1604980.14]
["AA0500","0303010305","Prestazioni servizi MMG, PLS, Continuità assistenziale Extraregione",155741.96,119388.84]
["AA0510","0303010306","Prestazioni servizi farmaceutica convenzionata Extraregione",523609.47,502038.11]
["AA0520","0303010307","Prestazioni termali Extraregione",332335.62,172275.4]
["AA0530","0303010308","Prestazioni trasporto ambulanze ed elisoccorso Extraregione",267907.44,512404.02]
["AA0550","0303010311","Ricavi per cessione di emocomponenti e cellule staminali Extraregione",813,174766.05]
["AA0580","0303010313","Prestazioni di assistenza riabilitativa non soggette a compensazione Extraregione",1860.9,0]
["AA0590","0303010314","Altre prestazioni sanitarie e socio-sanitarie a rilevanza sanitaria non soggette a compensazione Extraregione",45933.3,1696.8]
["AA0620","0303020101","Prestazioni di ricovero da privati Extraregione in compensazione (mobilità attiva)",11496977.640000001,11917704.07]
["AA0630","0303020201","Prestazioni ambulatoriali da privati Extraregione in compensazione (mobilità attiva)",202279.88,218419.7]
["AA0660","0303030101","Proventi per rilascio cartelle cliniche, radiografie e certificati",127955.23,115699.42]
["AA0660","0303030102","Proventi per multe, ammende e contravvenzioni di vigili sanitari",10489.61,44855.15]
["AA0660","0303030104","Proventi per prestazioni di medicina del lavoro",5587.68,1020.47]
["AA0660","0303030105","Proventi per sanzioni sanità pubblica veterinaria",643.97,10077.74]
["AA0660","0303030106","Proventi per diritti veterinari ex art.3 D.lgs. 51/92",303629.69,312591.95]
["AA0660","0303030107","Proventi per sanzioni amministrative",188335.21,88655.9]
["AA0660","0303030108","Proventi sperimentazioni farmaci e cliniche",30453.03,80519.63]
["AA0660","0303030109","Proventi per servizi di medicina legale",335817.58,577975.03]
["AA0660","0303030110","Ricavi per somministrazione di vaccini",0,262.60000000000002]
["AA0660","0303030111","Proventi per prestazioni di medicina sportiva",28582.12,34421.300000000003]
["AA0660","0303030114","Altri ricavi per prestazioni sanitarie erogate a soggetti privati",573044.67000000004,320299.61]
["AA0660","0303030115","Ricavi per prestazioni specialistiche ambulatoriali  (a privati paganti)",784259.08,1158003.1399999999]
["AA0660","0303030116","Ricavi per ricovero ospedaliero ",98901.36,40542.93]
["AA0660","0303030117","Ricavi per prestazioni del dipartimento di prevenzione",506562.11,766497.59]
["AA0660","0303030118","Ricavi per consulenze sanitarie mediche e veterinarie",15446.02,14715.73]
["AA0660","0303030122","Ricavi cessione sangue ed emoderivati vs privati",521325.49,3268.12]
["AA0680","0303040101","Ricavi per prestazioni sanitarie intramoenia - Area ospedaliera",89330.21,50045.82]
["AA0690","0303040201","Ricavi per prestazioni sanitarie intramoenia - Area specialistica",3216315.61,3252006]
["AA0700","0303040301","Ricavi per prestazioni sanitarie intramoenia - Area sanità pubblica",19348.810000000001,22414.54]
["AA0710","0303040401","Ricavi per prestazioni sanitarie intramoenia - Consulenze (ex art. 55 c. 1 lett. c), d) ed ex art. 57-58)",520863.67,478823.7]
["AA0730","0303040601","Ricavi per prestazioni sanitarie intramoenia - Altro",109709.92,97870.17]
["AA0740","0303040701","Ricavi per prestazioni sanitarie intramoenia - Altro (Aziende sanitarie pubbliche della Regione)",0,18272.099999999999]
["AA0760","0304010101","Rimborsi assicurativi",570386.93999999994,166973.67000000001]
["AA0810","0304030101","Rimborso degli oneri stipendiali del personale dipendente dell'azienda in posizione di comando presso Aziende sanitarie pubbliche della Regione",0,14346.46]
["AA0830","0304030301","Altri concorsi, recuperi e rimborsi da parte di Aziende sanitarie pubbliche della Regione",142391.67000000001,135883.64000000001]
["AA0850","0304040101","Rimborso degli oneri stipendiali del personale dipendente dell'azienda in posizione di comando presso altri soggetti pubblici",117798.94,114750.81]
["AA0860","0304040201","Rimborsi per acquisto beni sanitari v/altri Enti Pubblici",19160.62,14709.64]
["AA0870","0304040303","Concorso da comuni per integr.rette RSA",4426.3100000000004,87662]
["AA0870","0304040304","Altri concorsi, recuperi e rimborsi da parte di altri soggetti pubblici",84,70008.22]
["AA0900","0304050101","Pay-back per il superamento del tetto della spesa farmaceutica territoriale",0,0]
["AA0910","0304050102","Pay-back per il superamento del tetto della spesa farmaceutica ospedaliera",0,20]
["AA0920","0304050103","Ulteriore Pay-back",1431892.14,3426932.4]
["AA0930","0304050201","Altri concorsi, recuperi e rimborsi da privati",674491.36,866980.31]
["AA0950","0305010101","Compartecipazione alla spesa per prestazioni sanitarie - Ticket sulle prestazioni per visite specialistiche",2890429.38,3378962.08]
["AA0950","0305010102","Compartecipazione alla spesa per prestazioni sanitarie - Ticket sulle prestazioni per diagnostica strumentale",1513291.51,1382098.47]
["AA0950","0305010103","Compartecipazione alla spesa per prestazioni sanitarie - Ticket sulle prestazioni per analisi di laboratorio",1628297.52,1653708.77]
["AA0960","0305020101","Compartecipazione alla spesa per prestazioni sanitarie - Ticket sul pronto soccorso",567331.92000000004,330322.76]
["AA0990","0306010101","Quota imputata all'esercizio dei finanziamenti per investimenti dallo Stato",55380.81,48286.07]
["AA1000","0306020101","Quota imputata all'esercizio dei finanziamenti per investimenti da Regione",1574332.01,1468544.84]
["AA1010","0306030101","Quota imputata all'esercizio dei finanziamenti per beni di prima dotazione",3577467.93,3577467.93]
["AA1020","0306040101","Quota imputata all'esercizio dei contributi in c/esercizio FSR destinati ad investimenti",3299309.48,4730694.3099999996]
["AA1070","0308010102","Ricavi per consulenze, certificazioni e attestazioni non sanitarie",0,1820.06]
["AA1070","0308010103","Ricavi per maggior comfort alberghiero",3063,1203.5999999999999]
["AA1070","0308010106","Altri ricavi per prestazioni non sanitarie",500,0]
["AA1080","0308020101","Affitti attivi ",221554.44,221560.64]
["AA1090","0308030102","Proventi per multe, ammende e contravvenzioni (non sanitarie)",28997.61,39513.47]
["AA1090","0308030104","Proventi per gestione distributori automatici di bibite",24734.44,13350.83]
["AA1090","0308030105","Proventi per corsi di formazione",49070,50820]
["AA1090","0308030109","Altri proventi non sanitari",206647.14,294032.8]
["BA0040","0701010101","Medicinali con AIC",-55133618.719999999,-58058876.310000002]
["BA0040","0701010102","Soluzioni infusionali con AIC",-32331.27,-36070.949999999997]
["BA0040","0701010103","Ossigeno con AIC",-1424717.16,-1784465.77]
["BA0040","0701010104","Altri gas medicali con AIC",-46392.2,-169365.48]
["BA0040","0701010105","Emoderivati con AIC",-3757305.78,-3209150.92]
["BA0040","0701010108","Farmaci innovativi",-6062470.3200000003,-5977880.04]
["BA0050","0701010106","Medicinali senza AIC",-1300987.46,-722585.84]
["BA0090","0701010202","Sangue ed emocomponenti da pubblico (Aziende sanitarie pubbliche extra Regione) - Mobilità extraregionale",-3037,-187348.99]
["BA0090","0701010204","Costi per plasmaderivazione da pubblico (Aziende sanitarie pubbliche extra Regione) - Mobilità extraregionale",-130003.57,0]
["BA0220","0701010301","Strumentazione per bioimmagini e radioterapia",-211426.5,-177143.11]
["BA0220","0701010302","Materiale per sterilizzazione",-97003.78,-129624.42]
["BA0220","0701010303","Dispositivi per chirurgia mini-invasiva ed elettrochirurgia",-1235479.01,-1449807.99]
["BA0220","0701010304","Protesi ortopediche e mezzi per osteosintesi e sintesi tendineo-legamentosa",-2949180.05,-2805651.43]
["BA0220","0701010305","Protesi oculistiche",-179179.78,-204139.51999999999]
["BA0220","0701010306","Protesi vascolari e cardiache",-1580161.31,-1648630.99]
["BA0220","0701010307","Altri dispositivi protesici impiantabili e prodotti per osteosintesi",-106836.33,-64076.91]
["BA0220","0701010308","Supporti e ausili tecnici per persone disabili",-87809.16,-88676.58]
["BA0220","0701010309","Dispositivi per emotrasfusione ed ematologia",-1082398.01,-639214.71]
["BA0220","0701010310","Dispositivi per dialisi",-1498034.56,-1517787.64]
["BA0220","0701010312","Dispositivi da somministrazione, prelievo e raccolta ",-3478757.96,-3502487.78]
["BA0220","0701010314","Strumentazione per esplorazioni funzionali ed interventi terapeutici",-738929.76,-955175.28]
["BA0220","0701010315","Strumentazione per radiologia diagnostica ed interventistica",-1473.64,-1054.08]
["BA0220","0701010316","Strumentario chirurgico pluriuso o riusabile",-544050.55000000005,-736677.23]
["BA0220","0701010317","Dispositivi protesici impiantabili - vari",-231285.84,-201076.3]
["BA0220","0701010318","Dispositivi per sistema artero-venoso",-1701031.92,-1942531.26]
["BA0220","0701010319","Guide per apparato cardiocircolatorio",-324324.69,-436779.31]
["BA0220","0701010320","Altri dispositivi per apparato cardiocircolatorio",-923363.6,-934868.19]
["BA0220","0701010321","Disinfettanti, antisettici e proteolitici (D.Lgs. 46/97)",-90513.81,-95830.94]
["BA0220","0701010322","Dispositivi per apparato gastrointestinale",-233603.82,-345091.34]
["BA0220","0701010323","Dispositivi da sutura",-1636156.91,-1485021.04]
["BA0220","0701010324","Dispositivi per sistema nervoso e midollare",-78330.59,-79263.37]
["BA0220","0701010325","Dispositivi per odontoiatria, oftalmologoa e otorinolaringoiatria",-357509.98,-364072.05]
["BA0220","0701010326","Dispositivi per apparato respiratorio e anestesia",-599615.78,-505376.99]
["BA0220","0701010327","Dispositivi di protezione e ausili per incontinenza (D.Lgs. 46/97)",-1366976.08,-1642742.81]
["BA0220","0701010328","Dispositivi per apparato urogenitale",-238337.12,-204049.87]
["BA0220","0701010329","Dispositivi vari",-1772125.5,-1684981.19]
["BA0220","0701010330","Dispositivi per medicazioni generali e specialistiche",-1883723.16,-1922863.46]
["BA0230","0701010313","Dispositivi impiantabili attivi",-3795874.49,-3456008.28]
["BA0240","0701010311","Dispositivi medico-diagnostici in vitro (D.Lgs. 332/2000)",-11448832.449999999,-11969007.5]
["BA0250","0701010401","Prodotti dietetici",-23720.84,-29236.46]
["BA0250","0701010402","Alimenti per nutrizione artificiale senza AIC",-416946.32,-440409.28]
["BA0260","0701010501","Sieri",-93.5,0]
["BA0260","0701010502","Vaccini obbligatori",-536893.44999999995,-602023.59]
["BA0260","0701010503","Altri vaccini",-843601.46,-1778838.97]
["BA0280","0701010701","Medicinali ad uso veterinario",-7056.26,-7133.98]
["BA0280","0701010702","Materiali chirurgici, sanitari e diagnostici per uso veterinario",-26245.03,-718.82]
["BA0290","0701010801","Vetrerie e materiale plastico per laboratorio (senza CND)",-49830.97,-49771.13]
["BA0290","0701010802","Altri materiali di consumo non specifici per strumentazione diagnostica (senza CND)",-271010.71000000002,-532760.96]
["BA0290","0701010803","Altri beni e prodotti sanitari (senza CND)",-1192488.55,-1352042.51]
["BA0320","0701020101","Prodotti alimentari",-259.32,-250.58]
["BA0330","0701020102","Materiali di guardaroba, di pulizia e di convivenza in genere",-29848.15,-41796.379999999997]
["BA0340","0701020103","Combustibili, carburanti e lubrificanti",-125554.88,-135937.70000000001]
["BA0350","0701020104","Supporti informatici",-175026.66,-186697.36]
["BA0350","0701020105","Cancelleria e stampati",-422391.03,-327030.51]
["BA0360","0701020106","Materiale per la manutenzione di immobili e loro pertinenze",-149268.04999999999,-181769.46]
["BA0360","0701020107","Materiale per la manutenzione di mobili e macchine",-1605.52,0]
["BA0360","0701020108","Materiale per la manutenzione di attrezzature tecnico scientifiche sanitarie",-90033.55,-16225.33]
["BA0360","0701020110","Materiale per la manutenzione di altro",-11831.69,-9788.74]
["BA0370","0701020111","Altri beni e prodotti non sanitari",-49743.28,-48626.559999999998]
["BA0430","0702010101","Costi per assistenza MMG",-24527412.66,-24328709.329999998]
["BA0440","0702010102","Costi per assistenza PLS",-6297522.9199999999,-6208374.4000000004]
["BA0450","0702010103","Costi per assistenza Continuità assistenziale",-4154724.75,-4008916.53]
["BA0460","0702010104","Costi per assistenza Medici 118",-728791.69,-718220.61]
["BA0460","0702010105","Altro (medicina dei servizi, psicologi, etc¿) (esclusa IRAP)",-181313.87,-171628.48]
["BA0470","0702010106","Costi per medicina di base da pubblico (Aziende sanitarie pubbliche della Regione) - Mobilità intraregionale",-83439.399999999994,-35057.19]
["BA0480","0702010107","Costi per medicina di base da pubblico (Aziende sanitarie pubbliche Extraregione) - Mobilità extraregionale",-173343.96,-184748.58]
["BA0500","0702010201","Acquisti servizi sanitari per farmaceutica da convenzione",-52890823.369999997,-52796218.850000001]
["BA0500","0702010202","Acquisti servizi sanitari sussidi  Indennità per farmacie rurali ed altro",-123456.53,-127926.67]
["BA0510","0702010203","Costi per farmaceutica da pubblico (Aziende sanitarie pubbliche della Regione)- Mobilità intraregionale",-1241012.19,-1251970.51]
["BA0520","0702010204","Costi per farmaceutica da pubblico (Extraregione)",-381774.76,-387832.02]
["BA0540","0702010301","Costi per assistenza specialistica ambulatoriale da pubblico (Aziende sanitarie pubbliche della Regione)",-7174231.6799999997,-7681961.0099999998]
["BA0540","0702010302","Servizi sanitari da privato accreditato insito in Regione territorio extra ASL v/ cittadini residenti in territorio ASL  - rientranti nei contratti negoziali (branche a visita)",-561.88,-82.34]
["BA0540","0702010303","Servizi sanitari da case di cura private insite in Regione territorio extra ASL v/ cittadini residenti in territorio ASL - rientranti nei contratti negoziali (assistenza specialistica ambulatoriale)",-1272794.1200000001,-1255932.25]
["BA0540","0702010304","Servizi sanitari da altri soggetti privati insiti in Regione territorio extra ASL v/cittadini residenti nel territorio ASL rientranti nei contratti negoziali (assistenza specialistica ambulatoriale)",-76580.98,-60146.51]
["BA0550","0702010305","Costi per assistenza specialistica ambulatoriale da pubblico (altri soggetti pubblici della Regione)",-224364.91,-189344.67]
["BA0560","0702010306","Costi per assistenza specialistica ambulatoriale  da pubblico (Extraregione)",-3048586.34,-4257839.75]
["BA0560","0702010325","Costi per cessioni di emocomponenti e cellule staminali extraregione",0,-202185.19]
["BA0570","0702010307","Costi per assistenza specialistica ambulatoriale  da privato - Medici SUMAI",-5114503.17,-4899151.05]
["BA0590","0702010308","Servizi sanitari per assistenza specialistica da IRCCS privati e Policlinici privati",-44362.83,-60978.73]
["BA0610","0309010805","Compartecipazione alla spesa per prestazioni sanitarie - Ticket sulle prestazioni assistenza specialistica ambulatoriale da Case di Cura private",967627.53,1025595.31]
["BA0610","0309010806","Quota fissa di cui all¿art. 17, comma 6, del D.L. 98/2011 per assistenza specialistica ambulatoriale da Case di Cura private ",332390,352280]
["BA0610","0702010310","Servizi sanitari da case di cura private insite nel territorio ASL v/ cittadini residenti  nel territorio ASL - rientranti nei contratti negoziali (assistenza specialistica ambulatoriale)",-4477208.66,-4475774.26]
["BA0610","0702010311","Servizi sanitari da case di cura private insite nel territorio ASL v/cittadini residenti nella Regione in territorio extra ASL rientranti nei contratti negoziali (assist. specialistica ambulatoriale)",-2186662.89,-2312295.34]
["BA0610","0702010313","Servizi sanitari da case di cura private - per cittadini residenti acquistate fuori contratti negoziali in strutture entro Regione (assistenza specialistica ambulatoriale)",-579,-2664.58]
["BA0620","0309010807","Compartecipazione alla spesa per prestazioni sanitarie - Ticket sulle prestazioni assistenza specialistica ambulatoriale da altri privati",136665.46,216258.62]
["BA0620","0309010808","Quota fissa di cui all¿art. 17, comma 6, del D.L. 98/2011 per assistenza specialistica ambulatoriale da altri privati ",0,18668]
["BA0620","0702010314","Servizi sanitari da privato accreditato insito nel territorio ASL v/ cittadini residenti in territorio ASL - rientranti nei contratti negoziali (branche a visita)",-33898.199999999997,-28717.88]
["BA0620","0702010315","Servizi sanitari da privato accreditato insito nel territorio ASL v/ cittadini residenti nella Regione in territorio extra ASL - rientranti nei contratti negoziali (branche a visita)",-1872.04,-3499.07]
["BA0620","0702010318","Servizi sanitari da altri soggetti privati insiti nel Territorio ASL v/ cittadini residenti nel territorio ASL - rientranti nei contratti negoziali (assistenza specialistica ambulatoriale)",-2942178.96,-2993859.48]
["BA0620","0702010319","Servizi sanitari da altri soggetti privati insiti nel territorio ASL v/cittadini residenti nella Regione in territorio extra ASL rientranti nei contratti negoziali (ass. specialistica ambulatoriale)",-346767.47,-490557.54]
["BA0620","0702010321","Servizi sanitari da altri soggetti privati - per cittadini residenti acquistate fuori contratti negoziali in strutture entro Regione (assistenza specialistica ambulatoriale)",0,-2298.15]
["BA0630","0309010304","Sconti da altri soggetti privati v/ cittadini non residenti - extraregione (mobilità attiva in compensazione)",3399,0]
["BA0630","0309010809","Compartecipazione alla spesa per prestazioni sanitarie - Ticket sulle prestazioni assistenza specialistica ambulatoriale da privato per cittadini non residenti - Extraregione",2357.0300000000002,3321.5]
["BA0630","0309010810","Quota fissa di cui all¿art. 17, comma 6, del D.L. 98/2011 per assistenza specialistica ambulatoriale da privato per cittadini non residenti - Extraregione",280,400]
["BA0630","0702010322","Servizi sanitari da privato accreditato v/ cittadini non residenti - extraregione (mobilità attiva in compensazione) (branche a visita)",-117.49,0]
["BA0630","0702010323","Servizi sanitari da case di cura private v/ cittadini non residenti - extraregione (mobilità attiva in compensazione)  (assistenza specialistica ambulatoriale)",-171160.86,-181939.89]
["BA0630","0702010324","Servizi sanitari da altri soggetti privati v/ cittadini non residenti - extraregione (mobilità attiva in compensazione) (assistenza specialistica ambulatoriale)",-31001.53,-36479.81]
["BA0650","0702010402","Da privato accreditato insito in Regione territorio extra ASL v/ cittadini residenti in territorio ASL  - rientranti nei contratti negoziali (riabilitazione ex art. 26)",-4525129.8,-4855060.17]
["BA0680","0702010405","Da privato accreditato insito nel territorio ASL v/ cittadini residenti in territorio ASL - rientranti nei contratti negoziali (riabilitazione ex art. 26)",-11051824.24,-10990063.199999999]
["BA0680","0702010406","Da privato accreditato insito nel territorio ASL v/ cittadini residenti nella Regione in territorio extra ASL - rientranti nei contratti negoziali (riabilitazione ex art. 26)",-3391939.12,-3470706.26]
["BA0690","0702010408","Da privato accreditato per cittadini residenti acquistate in strutture fuori Regione (riabilitazione ex art. 26)",-792965.98,-591378.35]
["BA0740","0702010504","Da privato per assistenza integrativa",-1692964.4,-1813040.82]
["BA0790","0702010604","Da privato per assistenza protesica",-4944153.2300000004,-4792096.16]
["BA0790","0702010605","Da privato per materiale per incontinenza",-1666710.12,-1592199.38]
["BA0810","0702010701","Da pubblico per assistenza ospedaliera (Aziende sanitarie pubbliche della Regione)",-25693452.690000001,-25677170]
["BA0810","0702010702","Da privato accreditato per assistenza ospedaliera insito in Regione territorio extra ASL v/cittadini residenti in territorio ASL - rientranti nei contratti negoziali ",-2515771.6800000002,-2552921.6800000002]
["BA0830","0702010704","Da pubblico per assistenza ospedaliera (Extraregione)",-23636269.289999999,-23048879.050000001]
["BA0870","0309010905","Compartecipazione alla spesa per prestazioni sanitarie - Ticket sulle sulle prestaz. trasferite dal regime di ricovero ordinario in regime ambulatoriale (DCA 50/2011) da Case di Cura private",59719.8,70673.25]
["BA0870","0309010906","Quota fissa di cui all¿art. 17, comma 6, del D.L. 98/2011 per prestaz. trasferite dal regime di ricovero ordinario in regime ambulatoriale (DCA 50/2011) da Case di Cura private ",16520,19550]
["BA0870","0702010708","Da privato accreditato per assistenza ospedaliera insito nel territorio ASL v/ cittadini residenti in territorio ASL - rientranti nei contratti negoziali ",-30555560.66,-30343478.91]
["BA0870","0702010709","Da privato accreditato per assistenza ospedaliera insito nel territorio ASL v/ cittadini residenti nella Regione in territorio extra ASL - rientranti nei contratti negoziali ",-31091191.059999999,-31556509.059999999]
["BA0890","0702010705","Da privato accreditato per assistenza ospedaliera per cittadini non residenti - extraregione (mobilità attiva in compensazione) ",-11496977.640000001,-11917704.07]
["BA0910","0702010802","Da privato accreditato insito in Regione territorio extra ASL v/ cittadini residenti in territorio ASL  - rientranti nei contratti negoziali  (Strutture Psicoriabilitative)",-1713800.54,-1648164.66]
["BA0930","0702010804","Da pubblico per psichiatria residenziale e semiresidenziale (Extraregione) - non soggette a compensazione",-32900.5,-6667]
["BA0940","0702010805","Da privato accreditato insito nel territorio ASL v/cittadini residenti in territorio ASL - rientranti nei contratti negoziali (Strutture Psicoriabilitative) (intraregionale)",-4108614.4,-4344965.76]
["BA0940","0702010806","Da privato accreditato insito nel territorio ASL v/cittadini residenti nella Regione in territorio extra ASL - rientranti nei contratti negoziali (Strutture psicoriabilitative) (intraregionale)",-4761138.87,-4556497.3099999996]
["BA0940","0702010807","Da privato accreditato per cittadini residenti acquistate fuori contratti negoziali in strutture entro Regione (Strutture Psicoriabilitative) (intraregionale)",-772771.01,-770417.52]
["BA0950","0702010809","Da privato accreditato per cittadini residenti acquistate in strutture fuori Regione (Strutture Psicoriabilitative) (extraregionale)",-2178595.92,-1872398.81]
["BA0970","0702010901","Da pubblico per prestazioni di distribuzione farmaci File F (Aziende sanitarie pubbliche della Regione) - Mobilità intraregionale",-5023688.8099999996,-4391409.7]
["BA0990","0702010903","Da pubblico per prestazioni di distribuzione farmaci File F (Extraregione)",-1172122.05,-1585422.33]
["BA1040","0702011002","Da privato accreditato per prestazioni termali in convenzione insito in Regione territorio extra ASL v/ cittadini residenti in territorio ASL  - rientranti nei contratti negoziali ",-46.2,0]
["BA1060","0702011004","Da pubblico per prestazioni termali in convenzione (Extraregione)",-199293.42,-159884.29]
["BA1070","0309011001","Compartecipazione alla spesa per prestazioni sanitarie - Ticket sulle prestazioni termali in convenzione - da privato",467238.1,448685.4]
["BA1070","0702011005","Da privato accreditato per prestazioni termali in convenzione insito nel territorio ASL v/ cittadini residenti in territorio ASL - rientranti nei contratti negoziali ",-1060619.82,-985595.98]
["BA1070","0702011006","Da privato accreditato per prestazioni termali in convenzione insito nel territorio ASL v/ cittadini residenti nella Regione in territorio extra ASL - rientranti nei contratti negoziali",-1401079.15,-1351679.39]
["BA1080","0309011003","Compartecipazione alla spesa per prestazioni sanitarie - Ticket sulle prestazioni termali in convenzione - da privato per cittadini non residenti - Extraregione",64675.3,61178.8]
["BA1080","0702011009","Da privato per prestazioni termali in convenzione per cittadini non residenti - Extraregione (mobilità attiva in compensazione)",-324939.2,-301368.37]
["BA1100","0702011101","Da pubblico (Aziende sanitarie pubbliche della Regione) per trasporti sanitari per l'emergenza (Mobilità intraregionale)",-76616.539999999994,-124342.79]
["BA1120","0702011105","Da pubblico per trasporti sanitari per l'emergenza (Extraregione)",-91959.29,-228483.68]
["BA1130","0702011107","Da privato per trasporti sanitari per l'emergenza",-5821795.8200000003,-6679147.3799999999]
["BA1130","0702011108","Da privato per altri tipi di trasporto sanitario ",-1440553.51,-1480764]
["BA1150","0702011205","Da privato accreditato insito in Regione territorio extra ASL v/ cittadini residenti in territorio ASL  - rientranti nei contratti negoziali  (Centri Residenziali)",-1342493.15,-1337419.83]
["BA1150","0702011206","Da privato accreditato insito in Regione territorio extra ASL v/ cittadini residenti in territorio ASL  - rientranti nei contratti negoziali  (Residenze Sanitarie Assistite)",-587118.25,-400041.29]
["BA1170","0702011211","Da pubblico per assistenza geriatrica (extraregione) non soggetto a compensazione",-334811.51,-168459.48]
["BA1180","0702011215","Da privato accreditato insito nel territorio ASL v/ cittadini residenti in territorio ASL - rientranti nei contratti negoziali (Centri Residenziali)",-660607.18999999994,-621441.44999999995]
["BA1180","0702011216","Da privato accreditato insito nel territorio ASL v/ cittadini residenti nella Regione in territorio extra ASL - rientranti nei contratti negoziali (Centri Residenziali)",-112156.53,-151334.26999999999]
["BA1180","0702011218","Da privato accreditato insito nel territorio ASL v/ cittadini residenti in territorio ASL - rientranti nei contratti negoziali (Residenze Sanitarie Assistite)",-3134257.74,-2850165.21]
["BA1180","0702011219","Da privato accreditato insito nel territorio ASL v/ cittadini residenti nella Regione in territorio extra ASL - rientranti nei contratti negoziali (Residenze Sanitarie Assistite)",-1701102.98,-1770163.85]
["BA1180","0702011221","Da privato per assistenza ai tossicodipendenti e alcolisti  (intraregionale)",-1237508.8700000001,-1018117.84]
["BA1180","0702011224","Assistenza Domiciliare Integrata da privato (intraregionale)",-5101229.9400000004,-5249388.05]
["BA1180","0702011225","Altre prestazioni socio sanitarie a rilevanza sanitaria da privato (intraregionale e extraregionale)",-873506.81,-891013.35]
["BA1190","0702011226","Da privato accreditato per assistenza geriatrica per cittadini residenti acquistate in strutture fuori Regione (Centri Residenziali)",-76392.100000000006,-75595.22]
["BA1190","0702011227","Da privato accreditato per assistenza geriatrica per cittadini residenti acquistate in strutture fuori Regione (Residenze Sanitarie Assistite)",-35483.699999999997,-35386.75]
["BA1190","0702011228","Da privato per assistenza ai tossicodipendenti e alcolisti  (extraregionale)",-1443997.35,-1639945.78]
["BA1190","0702011229","Assistenza in Hospice da privato (extraregionale)",-50957.3,-840]
["BA1210","0702011301","Compartecipazione al personale per attività libero professionale intramoenia - Area ospedaliera",-62599.14,-34683.29]
["BA1210","0702011302","Fondo perequativo per attività libero professionale intramoenia - Area ospedaliera",-3276,-2118.0500000000002]
["BA1220","0702011304","Compartecipazione al personale per attività libero professionale intramoenia - Area specialistica",-2511347.34,-2628075.62]
["BA1220","0702011305","Fondo perequativo per attività libero professionale intramoenia - Area specialistica",-157502.91,-162576.15]
["BA1230","0702011307","Compartecipazione al personale per attività libero professionale intramoenia - Area sanità pubblica",-15933.74,-18048.23]
["BA1230","0702011308","Fondo perequativo per attività libero professionale intramoenia - Area sanità pubblica",-885.21,-1025.46]
["BA1240","0702011310","Compartecipazione al personale per attività libero professionale intramoenia - Consulenze (ex art. 55 c. 1 lett. c), d) ed ex art. 57-58)",-435479.19,-355672.03]
["BA1240","0702011311","Fondo perequativo per attività libero. professionale intramoenia - Consulenze (ex art. 55 c. 1 lett. c), d) ed ex art. 57-58)",-9331.19,-15821.31]
["BA1260","0702011316","Compartecipazione al personale per attività libero professionale intramoenia - Altro",-96287.97,-75468.47]
["BA1260","0702011318","Convenzioni per attività libero professionale intramoenia - Altro",0,0]
["BA1290","0702011401","Contributi ad associazioni di volontariato",-473982,-326600]
["BA1300","0702011402","Rimborsi per cure all'estero",-15911.61,0]
["BA1330","0702011407","Quota 3,5% a servizi veterinari della regione D.lgs 432/98",-12249.53,-9109.51]
["BA1330","0702011408","Quota 0,5% a laboratori nazionali D.lgs 432/98",-3050.03,-2495.91]
["BA1330","0702011410","Sussidi nefropatici",-179587.05,-182089.94]
["BA1330","0702011411","Contributi e sussidi per disabili psichici",-996078.19,-985172.98]
["BA1330","0702011412","Altri rimborsi, assegni e contributi",-291424.31,-245640.11]
["BA1340","0702011413","Rimborsi, assegni e contributi v/Aziende sanitarie pubbliche della Regione",-186201,-80]
["BA1360","0702011501","Consulenze sanitarie e sociosanitarie da Aziende sanitarie pubbliche della Regione",-368369.4,-298526.69]
["BA1370","0702011502","Consulenze sanitarie e sociosanitarie da terzi - Altri soggetti pubblici",-90118.47,-24433.75]
["BA1390","0702011503","Consulenze sanitarie da privato - articolo 55, comma 2, CCNL 8 giugno 2000",-2656011.58,-2372315.1800000002]
["BA1400","0702011505","Consulenze sanitarie e sociosanitarie da privato",-9289.34,-8005.29]
["BA1410","0702011509","Collaborazioni coordinate e continuative sanitarie e sociosanitarie da privato",-13270.74,-8413.1200000000008]
["BA1420","0702011510","Indennità a personale universitario - area sanitaria",-252571.97,-242210.34]
["BA1430","0702011511","Lavoro interinale - area sanitaria",-1558908.64,-2608784.9]
["BA1440","0702011515","Altre collaborazioni e prestazioni di lavoro - area sanitaria",0,-1378.08]
["BA1440","0702011516","Personale tirocinante compresi oneri riflessi",0,-6991.39]
["BA1440","0702011517","Borsisti compresi oneri riflessi",-961389.21,-1024154.57]
["BA1440","0702011518","Personale religioso adibito a mansioni sanitarie ",-57765.4,-47362.36]
["BA1440","0702011519","Medicina penitenziaria",-194472.27,-70885.7]
["BA1480","0702011522","Rimborso oneri stipendiali personale sanitario in comando da aziende di altre Regioni (Extraregione)",-41104.449999999997,-9790.09]
["BA1500","0702011601","Altri servizi sanitari e sociosanitari a rilevanza sanitaria da pubblico - Aziende sanitarie pubbliche della Regione",-50483.02,-13109.54]
["BA1530","0702011604","Altri servizi sanitari da privato",-2463217.4500000002,-2741606.08]
["BA1580","0702020101","Lavanderia",-6717141.3899999997,-5274953.32]
["BA1590","0702020102","Pulizia",-6128265.6900000004,-6089443.3399999999]
["BA1600","0702020103","Mensa",-3982167.1,-4117793.49]
["BA1610","0702020104","Riscaldamento",-1027893.49,-1064233.96]
["BA1620","0702020105","Servizi di assistenza informatica",-1500622.2,-1666759.65]
["BA1630","0702020106","Servizi trasporti (non sanitari)",0,-9272]
["BA1640","0702020107","Smaltimento rifiuti sanitari assimilati e assimilabili agli urbani",-41136,-15089.56]
["BA1640","0702020108","Smaltimento rifiuti sanitari speciali",-1253658.04,-1369549.07]
["BA1650","0702020109","Utenze telefoniche",-493458.34,-524835.69999999995]
["BA1660","0702020110","Utenze elettricità",-3423484.08,-3156167.9]
["BA1670","0702020111","Altre utenze",-461862.87,-705877.73]
["BA1690","0702020112","Premi di assicurazione - R.C. Professionale",-4540618.17,-4466553.17]
["BA1700","0702020113","Premi di assicurazione per rischi su immobili",-149877,-149871]
["BA1700","0702020114","Premi di assicurazione RC automezzi",-56046.02,-56926]
["BA1700","0702020115","Premi di assicurazione altri premi di assicurazione",-159654.73000000001,-136665.87]
["BA1740","0702020118","Servizio di vigilanza e sicurezza",-1767664.59,-1862266.45]
["BA1740","0702020119","Altri servizi appaltati",-4221198.53,-4379343.09]
["BA1740","0702020120","Spese di rappresentanza",-2464.4,-949]
["BA1740","0702020121","Spese postali",-390516.72,-251509.11]
["BA1740","0702020122","Quote per spese condominiali",-31412.03,-21247.49]
["BA1740","0702020123","Spese legali",-117701.67,-85408.79]
["BA1740","0702020124","Bolli e marchi",-57826.73,-58649.21]
["BA1740","0702020125","Abbonamenti, riviste e libri",-34447.629999999997,-37522.53]
["BA1740","0702020127","Altri servizi non sanitari da privato",-2640,-37851.33]
["BA1740","0702020130","Rimborsi spese personale del ruolo sanitario comparto",-24,-41.6]
["BA1740","0702020134","Rimborsi spese personale del ruolo tecnico comparto",-176.2,0]
["BA1790","0702020204","Consulenze tecniche",-261688.14,-37124.1]
["BA1790","0702020205","Consulenze legali",-350996.3,-481583.35]
["BA1790","0702020206","Altre consulenze non sanitarie",-932.64,0]
["BA1790","0702020207","Consulenze non sanitarie da privato ",-600,0]
["BA1800","0702020215","Collaborazioni coordinate e continuative non sanitarie da privato - ruolo amministrativo",-25849.06,-13535.39]
["BA1830","0702020223","Personale religioso adibito a mansioni non sanitarie",-91750.23,-117382.06]
["BA1890","0702020301","Formazione (esternalizzata e non) da pubblico",-67387.399999999994,-81237.64]
["BA1900","0702020302","Formazione (esternalizzata e non) da privato",-561047.22,-516106.58]
["BA1920","0703010101","Manutenzione e riparazione ai fabbricati e loro pertinenze immobili istituzionali o indisponibili",-7832253.2599999998,-9244877.5800000001]
["BA1940","0703030101","Manutenzione e riparazione alle attrezzature sanitarie e scientifiche",-5435954.5999999996,-5502395.79]
["BA1960","0703050101","Manutenzione e riparazione agli automezzi",-132622.04,-109400.27]
["BA1970","0703060101","Altre manutenzioni e riparazioni",-907722.94,-873012.59]
["BA2000","0704010101","Fitti passivi ",-1206607.57,-1239352.47]
["BA2020","0704020102","Canoni di noleggio - area sanitaria - attrezzature sanitarie",-4637175.95,-4751723.95]
["BA2020","0704020103","Altri canoni di noleggio  area sanitaria",-223024.29,-39136.379999999997]
["BA2030","0704020201","Canoni di noleggio - area non sanitaria - automezzi non sanitari",-197380.7,-174606.61]
["BA2030","0704020202","Canoni di noleggio - area non sanitaria - attrezzature non sanitarie",-286890.03000000003,-287452.83]
["BA2050","0704030103","Canoni di leasing operativo per attrezzature sanitarie",-986370,0]
["BA2120","0705010101","Costo del personale dirigente medico - tempo indeterminato - Competenze fisse",-46585137.509999998,-45055572.140000001]
["BA2120","0705010102","Costo del personale dirigente medico - tempo indeterminato - Indennità variabili",-1472134.23,-1455417.41]
["BA2120","0705010103","Costo del personale dirigente medico - tempo indeterminato - Premi e Incentivazioni",-3599647.77,-3664763.14]
["BA2120","0705010104","Costo del personale dirigente medico - tempo indeterminato - Straordinario",-689770.47,-925521.32]
["BA2120","0705010105","Costo del personale dirigente medico - tempo indeterminato - Oneri Sociali",-15335969.09,-15117441.619999999]
["BA2120","0705010107","Costo del personale dirigente medico - tempo indeterminato - Altri costi del personale",-25832.39,-24463.24]
["BA2130","0705010108","Costo del personale dirigente medico (non art. 15-septies D.Lgs. 502/92)- tempo determinato - Competenze fisse",-1004049.88,-1365651.13]
["BA2130","0705010109","Costo del personale dirigente medico (non art. 15-septies D.Lgs. 502/92)- tempo determinato - Indennità variabili",-46001.36,-73345.960000000006]
["BA2130","0705010110","Costo del personale dirigente medico (non art. 15-septies D.Lgs. 502/92)- tempo determinato - Premi e Incentivazioni",-94788.85,-10124.530000000001]
["BA2130","0705010111","Costo del personale dirigente medico (non art. 15-septies D.Lgs. 502/92)- tempo determinato - Straordinario",-17909.75,-43484.84]
["BA2130","0705010112","Costo del personale dirigente medico (non art. 15-septies D.Lgs. 502/92)- tempo determinato - Oneri Sociali",-321699.52,-413029.84]
["BA2130","0705010114","Costo del personale dirigente medico (non art. 15-septies D.Lgs. 502/92)- tempo determinato - Altri costi del personale",0,-44.02]
["BA2160","0705010201","Costo del personale dirigente non medico - tempo indeterminato - Competenze fisse",-3737766.67,-3736100.03]
["BA2160","0705010202","Costo del personale dirigente non medico - tempo indeterminato - Indennità variabili",-10009.24,-10911.04]
["BA2160","0705010203","Costo del personale dirigente non medico - tempo indeterminato - Premi e Incentivazioni",-192694.91,-168195.78]
["BA2160","0705010204","Costo del personale dirigente non medico - tempo indeterminato - Straordinario",-68720.41,-89673.54]
["BA2160","0705010205","Costo del personale dirigente non medico - tempo indeterminato - Oneri Sociali",-1059349.8600000001,-1059409.8600000001]
["BA2160","0705010207","Costo del personale dirigente non medico - tempo indeterminato - Altri costi del personale",-1346.46,-227.76]
["BA2170","0705010208","Costo del personale dirigente non medico (non art. 15-septies D.Lgs. 502/92)- tempo determinato - Competenze fisse",0,-35987.56]
["BA2170","0705010210","Costo del personale dirigente non medico (non art. 15-septies D.Lgs. 502/92)- tempo determinato - Premi e Incentivazioni",-3022.27,0]
["BA2170","0705010212","Costo del personale dirigente non medico (non art. 15-septies D.Lgs. 502/92)- tempo determinato - Oneri Sociali",-719.3,-9485.51]
["BA2170","0705010216","Costo del personale dirigente non medico art. 15-septies D.Lgs. 502/92- tempo determinato - Competenze fisse",-45906.03,-46315.19]
["BA2170","0705010217","Costo del personale dirigente non medico art. 15-septies D.Lgs. 502/92- tempo determinato - Indennità variabili",0,-20.66]
["BA2170","0705010218","Costo del personale dirigente non medico art. 15-septies D.Lgs. 502/92- tempo determinato - Premi e Incentivazioni",0,0]
["BA2170","0705010220","Costo del personale dirigente non medico art. 15-septies D.Lgs. 502/92- tempo determinato - Oneri Sociali",-12978.35,-13087.6]
["BA2170","0705010222","Costo del personale dirigente non medico art. 15-septies D.Lgs. 502/92- tempo determinato - Altri costi del personale",-922.6,0]
["BA2200","0705020101","Costo del personale comparto ruolo sanitario - tempo indeterminato - Competenze fisse",-45340224.880000003,-44536560.390000001]
["BA2200","0705020102","Costo del personale comparto ruolo sanitario - tempo indeterminato - Indennità variabili",-3248961.15,-3120224.68]
["BA2200","0705020103","Costo del personale comparto ruolo sanitario - tempo indeterminato - Premi e Incentivazioni",-2348796.0099999998,-1987825.16]
["BA2200","0705020104","Costo del personale comparto ruolo sanitario - tempo indeterminato - Straordinario",-879833.09,-1044373.28]
["BA2200","0705020105","Costo del personale comparto ruolo sanitario - tempo indeterminato - Oneri Sociali",-13631138.380000001,-13345209.789999999]
["BA2200","0705020107","Costo del personale comparto ruolo sanitario - tempo indeterminato - Altri costi del personale",-11292.96,-10316.01]
["BA2210","0705020201","Costo del personale comparto ruolo sanitario - tempo determinato - Competenze fisse",-392900.04,-572559.28]
["BA2210","0705020202","Costo del personale comparto ruolo sanitario - tempo determinato - Indennità variabili",-29918.18,-58186.33]
["BA2210","0705020203","Costo del personale comparto ruolo sanitario - tempo determinato - Premi e Incentivazioni",-19493.54,-10]
["BA2210","0705020204","Costo del personale comparto ruolo sanitario - tempo determinato - Straordinario",-2360.16,-4531.76]
["BA2210","0705020205","Costo del personale comparto ruolo sanitario - tempo determinato - Oneri Sociali",-116580.17,-177148.29]
["BA2210","0705020207","Costo del personale comparto ruolo sanitario - tempo determinato - Altri costi del personale",-8,0]
["BA2250","0706010101","Costo del personale dirigente ruolo professionale - tempo indeterminato - Competenze fisse",-230784,-269048.68]
["BA2250","0706010102","Costo del personale dirigente ruolo professionale - tempo indeterminato - Indennità variabili",-1743.54,-1968.27]
["BA2250","0706010103","Costo del personale dirigente ruolo professionale - tempo indeterminato - Premi e Incentivazioni",-40582.120000000003,-51671.1]
["BA2250","0706010105","Costo del personale dirigente ruolo professionale - tempo indeterminato - Oneri Sociali",-69495.05,-81986.27]
["BA2250","0706010107","Costo del personale dirigente ruolo professionale - tempo indeterminato - Altri costi del personale",-542.16,0]
["BA2260","0706010201","Costo del personale dirigente ruolo professionale (non art. 15-septies D.Lgs. 502/92)- tempo determinato - Competenze fisse",0,0]
["BA2260","0706010205","Costo del personale dirigente ruolo professionale (non art. 15-septies D.Lgs. 502/92)- tempo determinato - Oneri Sociali",0,0]
["BA2260","0706010208","Costo del personale dirigente ruolo professionale art. 15-septies D.Lgs. 502/92- tempo determinato - Competenze fisse",-57364.59,-15758.96]
["BA2260","0706010209","Costo del personale dirigente ruolo professionale art. 15-septies D.Lgs. 502/92- tempo determinato - Indennità variabili",0,-723.03]
["BA2260","0706010210","Costo del personale dirigente ruolo professionale art. 15-septies D.Lgs. 502/92- tempo determinato - Premi e Incentivazioni",0,0]
["BA2260","0706010212","Costo del personale dirigente ruolo professionale art. 15-septies D.Lgs. 502/92- tempo determinato - Oneri Sociali",-15672.45,-4641.8599999999997]
["BA2260","0706010214","Costo del personale dirigente ruolo professionale art. 15-septies D.Lgs. 502/92- tempo determinato - Altri costi del personale",-171.2,0]
["BA2290","0706020101","Costo del personale comparto ruolo professionale - tempo indeterminato - Competenze fisse",-24114.58,-8038.41]
["BA2290","0706020102","Costo del personale comparto ruolo professionale - tempo indeterminato - Indennità variabili",-2314.46,-776.98]
["BA2290","0706020103","Costo del personale comparto ruolo professionale - tempo indeterminato - Premi e Incentivazioni",-1299.57,-1016.7]
["BA2290","0706020105","Costo del personale comparto ruolo professionale - tempo indeterminato - Oneri Sociali",-7293.87,-2571.48]
["BA2340","0707010101","Costo del personale dirigente ruolo tecnico - tempo indeterminato - Competenze fisse",-332630.09999999998,-234988.73]
["BA2340","0707010103","Costo del personale dirigente ruolo tecnico - tempo indeterminato - Premi e Incentivazioni",-50727.65,-64588.88]
["BA2340","0707010105","Costo del personale dirigente ruolo tecnico - tempo indeterminato - Oneri Sociali",-98477.84,-76161.919999999998]
["BA2340","0707010107","Costo del personale dirigente ruolo tecnico - tempo indeterminato - Altri costi del personale",-315,0]
["BA2380","0707020101","Costo del personale comparto ruolo tecnico - tempo indeterminato - Competenze fisse",-11082649.689999999,-11238015.060000001]
["BA2380","0707020102","Costo del personale comparto ruolo tecnico - tempo indeterminato - Indennità variabili",-574768.18999999994,-569449.9]
["BA2380","0707020103","Costo del personale comparto ruolo tecnico - tempo indeterminato - Premi e Incentivazioni",-679604.23,-548976.65]
["BA2380","0707020104","Costo del personale comparto ruolo tecnico - tempo indeterminato - Straordinario",-244338.14,-276416.17]
["BA2380","0707020105","Costo del personale comparto ruolo tecnico - tempo indeterminato - Oneri Sociali",-3295584.7,-3326919.6]
["BA2380","0707020107","Costo del personale comparto ruolo tecnico - tempo indeterminato - Altri costi del personale",-2960.5,-3729.59]
["BA2390","0707020201","Costo del personale comparto ruolo tecnico - tempo determinato - Competenze fisse",-256276.55,-133953.13]
["BA2390","0707020202","Costo del personale comparto ruolo tecnico - tempo determinato - Indennità variabili",-2507.91,-1260.17]
["BA2390","0707020203","Costo del personale comparto ruolo tecnico - tempo determinato - Premi e Incentivazioni",-9653.2000000000007,0]
["BA2390","0707020204","Costo del personale comparto ruolo tecnico - tempo determinato - Straordinario",-5038.9399999999996,-3035.49]
["BA2390","0707020205","Costo del personale comparto ruolo tecnico - tempo determinato - Oneri Sociali",-134991.37,-38974.86]
["BA2430","0708010101","Costo del personale dirigente ruolo amministrativo - tempo indeterminato - Competenze fisse",-616029.57999999996,-568273.11]
["BA2430","0708010103","Costo del personale dirigente ruolo amministrativo - tempo indeterminato - Premi e Incentivazioni",0,-77506.649999999994]
["BA2430","0708010105","Costo del personale dirigente ruolo amministrativo - tempo indeterminato - Oneri Sociali",-171839.12,-178444.79]
["BA2470","0708020101","Costo del personale comparto ruolo amministrativo - tempo indeterminato - Competenze fisse",-6917869.5,-6887917.5099999998]
["BA2470","0708020102","Costo del personale comparto ruolo amministrativo - tempo indeterminato - Indennità variabili",-2687.35,-2315.64]
["BA2470","0708020103","Costo del personale comparto ruolo amministrativo - tempo indeterminato - Premi e Incentivazioni",-408753.69,-357940.5]
["BA2470","0708020104","Costo del personale comparto ruolo amministrativo - tempo indeterminato - Straordinario",-85135.44,-86735.4]
["BA2470","0708020105","Costo del personale comparto ruolo amministrativo - tempo indeterminato - Oneri Sociali",-1969483.03,-1952572.67]
["BA2470","0708020107","Costo del personale comparto ruolo amministrativo - tempo indeterminato - Altri costi del personale",-1578.37,-1237.28]
["BA2480","0708020201","Costo del personale comparto ruolo amministrativo - tempo determinato - Competenze fisse",0.65,1.1399999999999999]
["BA2480","0708020205","Costo del personale comparto ruolo amministrativo - tempo determinato - Oneri Sociali",0,0]
["BA2480","0708020207","Costo del personale comparto ruolo amministrativo - tempo determinato - Altri costi del personale",-868.23,-1369.45]
["BA2510","0709010101","Imposta di registro",-6360.19,-9142]
["BA2510","0709010102","Imposta di bollo",-1234,-804]
["BA2510","0709010104","Imposte comunali",-964226.02,-1068235]
["BA2510","0709010105","Tasse di circolazione automezzi",0,-1182.23]
["BA2510","0709010106","Altre imposte, tasse e tributi (escluse IRAP e IRES) ",-83749.399999999994,-81211.570000000007]
["BA2540","0709030101","Indennità, rimborso spese e oneri sociali per il Direttore Generale",-171878.68,-148784.1]
["BA2540","0709030102","Indennità, rimborso spese e oneri sociali per il Direttore Amministrativo",-128174.34,-129339.76]
["BA2540","0709030103","Indennità, rimborso spese e oneri sociali per il Direttore Sanitario",-134556.56,-167495.57]
["BA2540","0709030104","Indennità, rimborso spese e oneri sociali per i membri del Collegio sindacale",-45631.77,-44028.17]
["BA2540","0709030105","Indennità, rimborso spese e oneri sociali per i membri delle Commissioni varie",-954333.46,-941039.54]
["BA2550","0709030201","Oneri diversi da decreti ingiuntivi, liti, arbitraggi e risarcimenti",0,-328.09]
["BA2550","0709030202","Oneri diversi derivanti da transazioni",-15000,0]
["BA2550","0709030203","Altri oneri diversi di gestione",-337590.83,-292556.33]
["BA2570","0710010105","Ammortamento delle altre immobilizzazioni immateriali",-105301.39,-136552.39000000001]
["BA2610","0711020101","Ammortamento fabbricati strumentali (indisponibili)",-4970287.05,-4970287.05]
["BA2620","0712010101","Ammortamento impianti e macchinari",-256690.95,-263002.39]
["BA2620","0712010102","Ammortamento attrezzature sanitarie e scientifiche",-2925362.99,-4163720.13]
["BA2620","0712010103","Ammortamento mobili e arredi",-363135.86,-361188.29]
["BA2620","0712010104","Ammortamento automezzi",-102573.35,-122740.86]
["BA2620","0712010105","Ammortamento altri beni materiali",-254062.32,-244886.65]
["BA2670","0309010401","Rimanenze finali medicinali con AIC",4636666.55,4388956]
["BA2670","0309010402","Rimanenze finali soluzioni infusionali con AIC",1437.61,1398.76]
["BA2670","0309010403","Rimanenze finali ossigeno con AIC",10294.49,1633.04]
["BA2670","0309010404","Rimanenze finali altri gas medicali con AIC",2368.85,9993.4599999999991]
["BA2670","0309010405","Rimanenze finali emoderivati con AIC",298115.40000000002,415087.34]
["BA2670","0309010406","Rimanenze finali medicinali senza AIC",126880.91,220505.73]
["BA2670","0309010409","Rimanenze finali strumentazione per bioimmagini e radioterapia",0,22325.73]
["BA2670","0309010410","Rimanenze finali materiale per sterilizzazione",13554.18,44744.42]
["BA2670","0309010411","Rimanenze finali dispositivi per chirurgia mini-invasiva ed elettrochirurgia",174192.21,191192.48]
["BA2670","0309010412","Rimanenze finali protesi ortopediche e mezzi per osteosintesi e sintesi tendineo-legamentosa",50150.67,156988.5]
["BA2670","0309010413","Rimanenze finali protesi oculistiche",24968.06,21294.52]
["BA2670","0309010414","Rimanenze finali protesi vascolari e cardiache",1839.24,7516.08]
["BA2670","0309010415","Rimanenze finali altri dispositivi protesici impiantabili e prodotti per osteosintesi",10862.72,15680.73]
["BA2670","0309010416","Rimanenze finali supporti e ausili tecnici per persone disabili",21594.97,32718.44]
["BA2670","0309010417","Rimanenze finali dispositivi per emotrasfusione ed ematologia",45796.36,58519.51]
["BA2670","0309010418","Rimanenze finali strumentazione per esplorazioni funzionali ed interventi terapeutici",104045.91,270520.31]
["BA2670","0309010419","Rimanenze finali dispositivi per dialisi",179690.46,78184.86]
["BA2670","0309010420","Rimanenze finali strumentazione per radiologia diagnostica ed interventistica",589.26,712.51]
["BA2670","0309010421","Rimanenze finali strumentario chirurgico pluriuso o riusabile",55549.760000000002,92097.5]
["BA2670","0309010422","Rimanenze finali dispositivi medico-diagnostici in vitro (D.Lgs. 332/2000)",1255177.3999999999,1482372.12]
["BA2670","0309010423","Rimanenze finali dispositivi protesici impiantabili - vari",28003.05,80004.3]
["BA2670","0309010424","Rimanenze finali dispositivi per sistema artero-venoso",132460.47,196661.87]
["BA2670","0309010425","Rimanenze finali guide per apparato cardiocircolatorio",9174.4,16525.53]
["BA2670","0309010426","Rimanenze finali prodotti dietetici",4508.83,5615.65]
["BA2670","0309010427","Rimanenze finali alimenti per nutrizione artificiale senza AIC",63760.33,58004.47]
["BA2670","0309010430","Rimanenze finali altri vaccini",0,1112.76]
["BA2670","0309010436","Rimanenze finali vetrerie e materiale plastico per laboratorio",26506.58,42717.86]
["BA2670","0309010437","Rimanenze finali materiali di consumo non specifici per strumentazione diagnostica",82188.66,125485.73]
["BA2670","0309010438","Rimanenze finali altri beni e prodotti sanitari",102717.74,127988.56]
["BA2670","0309010439","Rimanenze finali dispositivi da somministrazione, prelievo e raccolta",559635.56999999995,569117.94999999995]
["BA2670","0309010440","Rimanenze finali dispositivi impiantabili attivi",58041,30319.56]
["BA2670","0309010441","Rimanenze finali altri dispositivi per apparato cardiocircolatorio",124428.45,123103.54]
["BA2670","0309010442","Rimanenze finali disinfettanti, antisettici e proteolitici (D.Lgs. 46/97)",29235.99,22348.48]
["BA2670","0309010443","Rimanenze finali dispositivi per apparato gastrointestinale",59952.07,83693.42]
["BA2670","0309010444","Rimanenze finali dispositivi da sutura",396218.06,349748.67]
["BA2670","0309010445","Rimanenze finali dispositivi per sistema nervoso e midollare",12511.97,28260.43]
["BA2670","0309010446","Rimanenze finali dispositivi per odontoiatria, oftalmologoa e otorinolaringoiatria",105207.2,71817.279999999999]
["BA2670","0309010447","Rimanenze finali dispositivi per apparato respiratorio e anestesia",125642.41,182238.66]
["BA2670","0309010448","Rimanenze finali dispositivi di protezione e ausili per incontinenza (D.Lgs. 46/97)",212601.7,196921.3]
["BA2670","0309010449","Rimanenze finali dispositivi per apparato urogenitale",65964.789999999994,51126.59]
["BA2670","0309010450","Rimanenze finali dispositivi vari",234985.3,304842.71999999997]
["BA2670","0309010451","Rimanenze finali dispositivi per medicazioni generali e specialistiche",312836.58,357449.92]
["BA2670","0309010452","Rimanenze finali Farmaci innovativi",406045.08,796557.79]
["BA2670","0714010101","Rimanenze iniziali medicinali con AIC",-5274714.12,-4636666.55]
["BA2670","0714010102","Rimanenze iniziali soluzioni infusionali con AIC",-3117.21,-1437.61]
["BA2670","0714010103","Rimanenze iniziali ossigeno con AIC",-11934.33,-10294.49]
["BA2670","0714010104","Rimanenze iniziali altri gas medicali con AIC",-8360.19,-2368.85]
["BA2670","0714010105","Rimanenze iniziali emoderivati con AIC",-546577.01,-298115.40000000002]
["BA2670","0714010106","Rimanenze iniziali medicinali senza AIC",-111611.93,-126880.91]
["BA2670","0714010109","Rimanenze iniziali strumentazione per bioimmagini e radioterapia",-29748.48,0]
["BA2670","0714010110","Rimanenze iniziali materiale per sterilizzazione",-10623.87,-13554.18]
["BA2670","0714010111","Rimanenze iniziali dispositivi per chirurgia mini-invasiva ed elettrochirurgia",-170169.05,-174192.21]
["BA2670","0714010112","Rimanenze iniziali protesi ortopediche e mezzi per osteosintesi e sintesi tendineo-legamentosa",-65233.45,-50150.67]
["BA2670","0714010113","Rimanenze iniziali protesi oculistiche",-4357.6000000000004,-24968.06]
["BA2670","0714010114","Rimanenze iniziali protesi vascolari e cardiache",0,-1839.24]
["BA2670","0714010115","Rimanenze iniziali altri dispositivi protesici impiantabili e prodotti per osteosintesi",-29566.720000000001,-10862.72]
["BA2670","0714010116","Rimanenze iniziali supporti e ausili tecnici per persone disabili",-10313.98,-21594.97]
["BA2670","0714010117","Rimanenze iniziali dispositivi per emotrasfusione ed ematologia",-32946.33,-45796.36]
["BA2670","0714010118","Rimanenze iniziali strumentazione per esplorazioni funzionali ed interventi terapeutici",-287035.21000000002,-104045.91]
["BA2670","0714010119","Rimanenze iniziali dispositivi per dialisi",-192658.67,-179690.46]
["BA2670","0714010120","Rimanenze iniziali strumentazione per radiologia diagnostica ed interventistica",-3035.37,-589.26]
["BA2670","0714010121","Rimanenze iniziali strumentario chirurgico pluriuso o riusabile",-94988.55,-55549.760000000002]
["BA2670","0714010122","Rimanenze iniziali dispositivi medico-diagnostici in vitro (D.Lgs. 332/2000)",-1199655.32,-1255177.3999999999]
["BA2670","0714010123","Rimanenze iniziali dispositivi protesici impiantabili  - vari",-62849.41,-28003.05]
["BA2670","0714010124","Rimanenze iniziali dispositivi per sistema artero-venoso",-111809.84,-132460.47]
["BA2670","0714010125","Rimanenze iniziali guide per apparato cardiocircolatorio",-27401.68,-9174.4]
["BA2670","0714010126","Rimanenze iniziali prodotti dietetici",-8105.46,-4508.83]
["BA2670","0714010127","Rimanenze iniziali alimenti per nutrizione artificiale senza AIC",-68589.69,-63760.33]
["BA2670","0714010133","Rimanenze iniziali medicinali ad uso veterinario",-192,0]
["BA2670","0714010136","Rimanenze iniziali vetrerie e materiale plastico per laboratorio",-15533.26,-26506.58]
["BA2670","0714010137","Rimanenze iniziali materiali di consumo non specifici per strumentazione diagnostica",-103201,-82188.66]
["BA2670","0714010138","Rimanenze iniziali altri beni e prodotti sanitari",-87747.66,-102717.74]
["BA2670","0714010139","Rimanenze iniziali dispositivi da somministrazione, prelievo e raccolta",-573626.02,-559635.56999999995]
["BA2670","0714010140","Rimanenze iniziali dispositivi impiantabili attivi",-16290.36,-58041]
["BA2670","0714010141","Rimanenze iniziali altri dispositivi per apparato cardiocircolatorio",-79721.490000000005,-124428.45]
["BA2670","0714010142","Rimanenze iniziali disinfettanti, antisettici e proteolitici (D.Lgs. 46/97)",-26457.53,-29235.99]
["BA2670","0714010143","Rimanenze iniziali dispositivi per apparato gastrointestinale",-50926.03,-59952.07]
["BA2670","0714010144","Rimanenze iniziali dispositivi da sutura",-306526.84000000003,-396218.06]
["BA2670","0714010145","Rimanenze iniziali dispositivi per sistema nervoso e midollare",-9075.2000000000007,-12511.97]
["BA2670","0714010146","Rimanenze iniziali dispositivi per odontoiatria, oftalmologoa e otorinolaringoiatria",-141685.25,-105207.2]
["BA2670","0714010147","Rimanenze iniziali dispositivi per apparato respiratorio e anestesia",-174448.95,-125642.41]
["BA2670","0714010148","Rimanenze iniziali dispositivi di protezione e ausili per incontinenza (D.Lgs. 46/97)",-199194.51,-212601.7]
["BA2670","0714010149","Rimanenze iniziali dispositivi per apparato urogenitale",-42691.15,-65964.789999999994]
["BA2670","0714010150","Rimanenze iniziali dispositivi vari",-300627.01,-234985.3]
["BA2670","0714010151","Rimanenze iniziali dispositivi per medicazioni generali e specialistiche",-383456.26,-312836.58]
["BA2670","0714010152","Rimanenze iniziali Farmaci innovativi",0,-406045.08]
["BA2680","0309010602","Rimanenze finali materiali di guardaroba, di pulizia e di convivenza in genere",35073.03,29727.94]
["BA2680","0309010604","Rimanenze finali supporti informatici",171772.85,192555.39]
["BA2680","0309010605","Rimanenze finali cancelleria e stampanti",161363.28,169734.96]
["BA2680","0309010606","Rimanenze finali materiali per la manutenzione di immobili e loro pertinenze",55250.31,85875.45]
["BA2680","0309010608","Rimanenze finali materiali per la manutenzione di attrezzature tecnico scientifiche sanitarie",25964.41,26463.29]
["BA2680","0309010610","Rimanenze finali di materiale per la manutenzione di altro",3934.22,5031.3999999999996]
["BA2680","0309010611","Rimanenze finali altri beni e prodotti non sanitari",2869.46,1229.74]
["BA2680","0714020102","Rimanenze iniziali materiali di guardaroba, di pulizia e di convivenza in genere",-44097.34,-35073.03]
["BA2680","0714020103","Rimanenze iniziali combustibili, carburanti e lubrificanti ",-364.21,0]
["BA2680","0714020104","Rimanenze iniziali supporti informatici",-182140.26,-171772.85]
["BA2680","0714020105","Rimanenze iniziali cancelleria e stampanti",-183602.38,-161363.28]
["BA2680","0714020106","Rimanenze iniziali materiali per la manutenzione di immobili e loro pertinenze",-99725.34,-55250.31]
["BA2680","0714020108","Rimanenze iniziali materiali per la manutenzione di attrezzature tecnico scientifiche sanitarie",-37640.720000000001,-25964.41]
["BA2680","0714020110","Rimanenze iniziali di materiale per la manutenzione di altro",-5697.59,-3934.22]
["BA2680","0714020111","Rimanenze iniziali altri beni e prodotti non sanitari",-3445.61,-2869.46]
["BA2710","0715010101","Accantonamenti per cause civili ed oneri processuali",-2008370.76,-9268206.2400000002]
["BA2720","0715010102","Accantonamenti per contenzioso personale dipendente",-665916.56999999995,-562892.11]
["BA2730","0715010103","Accantonamenti per rischi connessi all'acquisto di prestazioni sanitarie da privato al fondo debiti in contestazione ",0,-4358962]
["BA2740","0715010104","Accantonamenti per copertura diretta dei rischi (autoassicurazione)",-3681140.26,-3111381.31]
["BA2760","0715020101","Accantonamenti per premio di operosità (SUMAI)",-225172.71,-223015.56]
["BA2780","0715030112","Accantonamenti per quote inutilizzate contributi da Regione per quota Progetti di PSN L 662/96",-4021566.65,-7018127.5499999998]
["BA2790","0715030201","Accantonamenti per quote inutilizzate contributi da soggetti pubblici (extra fondo) vincolati",-180605.96,-50302.400000000001]
["BA2840","0715040201","Accantonamenti rinnovi convenzioni MMG/PLS/MCA",-407348,-653733]
["BA2850","0715040301","Accantonamenti rinnovi convenzioni medici Sumai",-48849,-82934]
["BA2860","0715040401","Accantonamenti rinnovi contrattuali: dirigenza medica",-278091,-757797]
["BA2870","0715040501","Accantonamenti rinnovi contrattuali: dirigenza non medica ruolo sanitario ",-20587,-56100]
["BA2870","0715040502","Accantonamenti rinnovi contrattuali: dirigenza non medica ruolo professionale ",-1673,-4558]
["BA2870","0715040503","Accantonamenti rinnovi contrattuali: dirigenza non medica ruolo tecnico ",-1972,-5373]
["BA2870","0715040504","Accantonamenti rinnovi contrattuali: dirigenza non medica ruolo amministrativo ",-3273,-8918]
["BA2880","0715040601","Accantonamenti rinnovi contrattuali: comparto ruolo sanitario ",-266239,-725501]
["BA2880","0715040602","Accantonamenti rinnovi contrattuali: comparto ruolo professionale ",-199,-543]
["BA2880","0715040603","Accantonamenti rinnovi contrattuali: comparto ruolo tecnico ",-65274,-177873]
["BA2880","0715040604","Accantonamenti rinnovi contrattuali: comparto ruolo amministrativo ",-38316,-104410]
["BA2890","0715040705","Altri accantonamenti ",0,-300000]
["CA0030","0401020101","Interessi attivi su c/c postali",14.16,0]
["CA0130","0801020101","Interessi passivi su mutui",0,0]
["CA0140","0801030101","Interessi moratori",-25667.27,-157753.12]
["CA0140","0801030102","Altri interessi passivi",-318.83,-73.63]
["CA0160","0802010101","Altri oneri finanziari",-167.46,-4522.33]
["EA0060","0601020201","Sopravvenienze attive v/Aziende sanitarie pubbliche della Regione relative alla mobilità intraregionale",91346.16,1937686]
["EA0060","0601020202","Altre sopravvenienze attive v/Aziende sanitarie pubbliche della Regione",32582.54,111766.26]
["EA0120","0601020207","Sopravvenienze attive v/terzi relative all'acquisto prestazioni sanitarie da operatori accreditati",284856.88,2999852.73]
["EA0130","0601020208","Sopravvenienze attive v/terzi relative all'acquisto di beni e servizi",302481.96999999997,341295.78]
["EA0140","0601020209","Sopravvenienze attive per attività libero professionale",22199.31,0]
["EA0140","0601020210","Altre sopravvenienze attive v/terzi",4015705.23,2010658.93]
["EA0220","0601020306","Insussistenze attive v/terzi relative all'acquisto prestazioni sanitarie da operatori accreditati",0,1672403.91]
["EA0230","0601020307","Insussistenze attive v/terzi relative all'acquisto di beni e servizi",92652.33,288245.17]
["EA0240","0601020308","Altre insussistenze attive v/terzi",205829.59,125240.07]
["EA0270","1001010101","Minusvalenze",-2495.9,0]
["EA0330","1001020301","Sopravvenienze passive v/Aziende sanitarie pubbliche relative alla mobilità intraregionale",-82615.08,0]
["EA0340","1001020302","Altre sopravvenienze passive v/Aziende sanitarie pubbliche della Regione",-88812.51,-134078.51]
["EA0380","1001020304","Sopravvenienze passive v/terzi relative al personale - dirigenza medica",-432547.66,-183240.74]
["EA0390","1001020305","Sopravvenienze passive v/terzi relative al personale - dirigenza non medica",-24961.1,-5333.38]
["EA0400","1001020306","Sopravvenienze passive v/terzi relative al personale - comparto",-407333.8,-363166.05]
["EA0410","1001020307","Sopravvenienze passive v/terzi relative alle convenzioni con medici di base",-90919.59,0]
["EA0420","1001020308","Sopravvenienze passive v/terzi relative alle convenzioni per la specialistica",0,-48576.12]
["EA0430","1001020309","Sopravvenienze passive v/terzi relative all'acquisto prestazioni sanitarie da operatori accreditati",-1108945.43,-25282.29]
["EA0440","1001020310","Sopravvenienze passive v/terzi relative all'acquisto di beni e servizi",-964208.68,-2651265.85]
["EA0450","1001020311","Sopravvenienze passive per attività libero professionale",-9393.1299999999992,0]
["EA0450","1001020312","Altre sopravvenienze passive v/terzi",-106206.68,-134394.78]
["EA0530","1001020406","Insussistenze passive v/terzi relative all'acquisto prestazioni sanitarie da operatori accreditati",-91.21,-832320.62]
["EA0540","1001020407","Insussistenze passive v/terzi relative all'acquisto di beni e servizi",-758.66,-115363.27]
["EA0550","1001020408","Altre insussistenze passive v/terzi",-1485001.41,-76578.070000000007]
["YA0020","1101010101","IRAP relativa al personale dipendente del ruolo sanitario",-9301675.0500000007,-9113825.9199999999]
["YA0020","1101010102","IRAP relativa al personale dipendente del ruolo professionale",-30579.29,-30362.880000000001]
["YA0020","1101010103","IRAP relativa al personale dipendente del ruolo tecnico",-1112810.1599999999,-927111.01]
["YA0020","1101010104","IRAP relativa al personale dipendente del ruolo amministrativo",-684021.49,-563084.71]
["YA0030","1101020101","IRAP relativa a collaboratori e personale assimilato a lavoro dipendente",-299518.09000000003,-272084.52]
["YA0030","1101020102","IRAP relativa ai medici di guardia medica",-167945.01,-145724.37]
["YA0030","1101020103","IRAP relativa ai medici 118",-34120.61,-41456.54]
["YA0030","1101020104","IRAP relativa ad altro (medicina dei servizi, psicologi, etc¿)",-12282.61,-11543.85]
["YA0040","1101030101","IRAP relativa ad attività intramoenia",-274847.06,-275247.39]
["YA0040","1101030102","IRAP libera professione relativa ad attività istituzionale (ex. art. 55 c. 2 CCNL)",-206507.19,-182825.02]
["YA0050","1101040101","IRAP relativa ad attività commerciale",-53498.21,-93278.75]
["YA0080","1102020101","IRES su attività commerciale",-426818,-490066]

{"sheet":"00 Aggregatore","index":1,"n_rows":375,"n_cols":6,"rows_kept":375,"cut":false,"hidden":false,"merged":[]}
[]
[null,null,null,null,"ANNO",2017]
[]
["Aggr","CE","Descrizione CE","C/R",{"$f":"IF($F$2=\"\",\"Anno T-1\",\"Esercizio \"&$F$2-1)","v":"Esercizio 2016"},{"$f":"IF($F$2=\"\",\"Anno T\",\"Esercizio \"&$F$2)","v":"Esercizio 2017"}]
[{"$f":"LEFT(B5,1)&D5","v":"AR"},"AA0030","Contributi da Regione o Provincia Autonoma per quota F.S. regionale indistinto","R",{"$f":"IF('00 Aggregatore'!$D5=\"R\",SUMIF('00 Alimenta'!$A:$A,$B5,'00 Alimenta'!D:D),SUMIF('00 Alimenta'!$A:$A,$B5,'00 Alimenta'!D:D)*-1)","v":546383676.54999995},{"$f":"IF('00 Aggregatore'!$D5=\"R\",SUMIF('00 Alimenta'!$A:$A,$B5,'00 Alimenta'!E:E),SUMIF('00 Alimenta'!$A:$A,$B5,'00 Alimenta'!E:E)*-1)","v":547765886.61000001}]
[{"$f":"LEFT(B6,1)&D6","v":"AR"},"AA0040","Contributi da Regione o Provincia Autonoma per quota F.S. regionale vincolato","R",{"$f":"IF('00 Aggregatore'!$D6=\"R\",SUMIF('00 Alimenta'!$A:$A,$B6,'00 Alimenta'!D:D),SUMIF('00 Alimenta'!$A:$A,$B6,'00 Alimenta'!D:D)*-1)","v":6083618.0599999996},{"$f":"IF('00 Aggregatore'!$D6=\"R\",SUMIF('00 Alimenta'!$A:$A,$B6,'00 Alimenta'!E:E),SUMIF('00 Alimenta'!$A:$A,$B6,'00 Alimenta'!E:E)*-1)","v":14815465.59}]
["AR","AA0070","Contributi da Regione o Provincia Autonoma (extra fondo) - Vincolati","R",{"$f":"IF('00 Aggregatore'!$D7=\"R\",SUMIF('00 Alimenta'!$A:$A,$B7,'00 Alimenta'!D:D),SUMIF('00 Alimenta'!$A:$A,$B7,'00 Alimenta'!D:D)*-1)","v":180605.96},{"$f":"IF('00 Aggregatore'!$D7=\"R\",SUMIF('00 Alimenta'!$A:$A,$B7,'00 Alimenta'!E:E),SUMIF('00 Alimenta'!$A:$A,$B7,'00 Alimenta'!E:E)*-1)","v":123104.1}]
["AR","AA0080","Contributi da Regione o Provincia Autonoma (extra fondo) - Risorse aggiuntive da bilancio regionale a titolo di copertura LEA","R",{"$f":"IF('00 Aggregatore'!$D8=\"R\",SUMIF('00 Alimenta'!$A:$A,$B8,'00 Alimenta'!D:D),SUMIF('00 Alimenta'!$A:$A,$B8,'00 Alimenta'!D:D)*-1)","v":0},{"$f":"IF('00 Aggregatore'!$D8=\"R\",SUMIF('00 Alimenta'!$A:$A,$B8,'00 Alimenta'!E:E),SUMIF('00 Alimenta'!$A:$A,$B8,'00 Alimenta'!E:E)*-1)","v":0}]
["AR","AA0090","Contributi da Regione o Provincia Autonoma (extra fondo) - Risorse aggiuntive da bilancio regionale a titolo di copertura extra LEA","R",{"$f":"IF('00 Aggregatore'!$D9=\"R\",SUMIF('00 Alimenta'!$A:$A,$B9,'00 Alimenta'!D:D),SUMIF('00 Alimenta'!$A:$A,$B9,'00 Alimenta'!D:D)*-1)","v":0},{"$f":"IF('00 Aggregatore'!$D9=\"R\",SUMIF('00 Alimenta'!$A:$A,$B9,'00 Alimenta'!E:E),SUMIF('00 Alimenta'!$A:$A,$B9,'00 Alimenta'!E:E)*-1)","v":0}]
["AR","AA0100","Contributi da Regione o Provincia Autonoma (extra fondo) - Altro","R",{"$f":"IF('00 Aggregatore'!$D10=\"R\",SUMIF('00 Alimenta'!$A:$A,$B10,'00 Alimenta'!D:D),SUMIF('00 Alimenta'!$A:$A,$B10,'00 Alimenta'!D:D)*-1)","v":0},{"$f":"IF('00 Aggregatore'!$D10=\"R\",SUMIF('00 Alimenta'!$A:$A,$B10,'00 Alimenta'!E:E),SUMIF('00 Alimenta'!$A:$A,$B10,'00 Alimenta'!E:E)*-1)","v":0}]
["AR","AA0120","Contributi da Aziende sanitarie pubbliche della Regione o Provincia Autonoma (extra fondo) - Vincolati","R",{"$f":"IF('00 Aggregatore'!$D11=\"R\",SUMIF('00 Alimenta'!$A:$A,$B11,'00 Alimenta'!D:D),SUMIF('00 Alimenta'!$A:$A,$B11,'00 Alimenta'!D:D)*-1)","v":0},{"$f":"IF('00 Aggregatore'!$D11=\"R\",SUMIF('00 Alimenta'!$A:$A,$B11,'00 Alimenta'!E:E),SUMIF('00 Alimenta'!$A:$A,$B11,'00 Alimenta'!E:E)*-1)","v":0}]
["AR","AA0130","Contributi da Aziende sanitarie pubbliche della Regione o Provincia Autonoma (extra fondo) - Altro","R",{"$f":"IF('00 Aggregatore'!$D12=\"R\",SUMIF('00 Alimenta'!$A:$A,$B12,'00 Alimenta'!D:D),SUMIF('00 Alimenta'!$A:$A,$B12,'00 Alimenta'!D:D)*-1)","v":232003.28},{"$f":"IF('00 Aggregatore'!$D12=\"R\",SUMIF('00 Alimenta'!$A:$A,$B12,'00 Alimenta'!E:E),SUMIF('00 Alimenta'!$A:$A,$B12,'00 Alimenta'!E:E)*-1)","v":0}]
["AR","AA0150","Contributi da altri soggetti pubblici (extra fondo) - Vincolati","R",{"$f":"IF('00 Aggregatore'!$D13=\"R\",SUMIF('00 Alimenta'!$A:$A,$B13,'00 Alimenta'!D:D),SUMIF('00 Alimenta'!$A:$A,$B13,'00 Alimenta'!D:D)*-1)","v":70020.75},{"$f":"IF('00 Aggregatore'!$D13=\"R\",SUMIF('00 Alimenta'!$A:$A,$B13,'00 Alimenta'!E:E),SUMIF('00 Alimenta'!$A:$A,$B13,'00 Alimenta'!E:E)*-1)","v":156684.25}]
["AR","AA0160","Contributi da altri soggetti pubblici (extra fondo) - Legge 210/92","R",{"$f":"IF('00 Aggregatore'!$D14=\"R\",SUMIF('00 Alimenta'!$A:$A,$B14,'00 Alimenta'!D:D),SUMIF('00 Alimenta'!$A:$A,$B14,'00 Alimenta'!D:D)*-1)","v":0},{"$f":"IF('00 Aggregatore'!$D14=\"R\",SUMIF('00 Alimenta'!$A:$A,$B14,'00 Alimenta'!E:E),SUMIF('00 Alimenta'!$A:$A,$B14,'00 Alimenta'!E:E)*-1)","v":0}]
["AR","AA0170","Contributi da altri soggetti pubblici (extra fondo) - Altro","R",{"$f":"IF('00 Aggregatore'!$D15=\"R\",SUMIF('00 Alimenta'!$A:$A,$B15,'00 Alimenta'!D:D),SUMIF('00 Alimenta'!$A:$A,$B15,'00 Alimenta'!D:D)*-1)","v":0},{"$f":"IF('00 Aggregatore'!$D15=\"R\",SUMIF('00 Alimenta'!$A:$A,$B15,'00 Alimenta'!E:E),SUMIF('00 Alimenta'!$A:$A,$B15,'00 Alimenta'!E:E)*-1)","v":0}]
["AR","AA0190","Contributi da Ministero della Salute per ricerca corrente","R",{"$f":"IF('00 Aggregatore'!$D16=\"R\",SUMIF('00 Alimenta'!$A:$A,$B16,'00 Alimenta'!D:D),SUMIF('00 Alimenta'!$A:$A,$B16,'00 Alimenta'!D:D)*-1)","v":0},{"$f":"IF('00 Aggregatore'!$D16=\"R\",SUMIF('00 Alimenta'!$A:$A,$B16,'00 Alimenta'!E:E),SUMIF('00 Alimenta'!$A:$A,$B16,'00 Alimenta'!E:E)*-1)","v":0}]
["AR","AA0200","Contributi da Ministero della Salute per ricerca finalizzata","R",{"$f":"IF('00 Aggregatore'!$D17=\"R\",SUMIF('00 Alimenta'!$A:$A,$B17,'00 Alimenta'!D:D),SUMIF('00 Alimenta'!$A:$A,$B17,'00 Alimenta'!D:D)*-1)","v":10216},{"$f":"IF('00 Aggregatore'!$D17=\"R\",SUMIF('00 Alimenta'!$A:$A,$B17,'00 Alimenta'!E:E),SUMIF('00 Alimenta'!$A:$A,$B17,'00 Alimenta'!E:E)*-1)","v":0}]
["AR","AA0210","Contributi da Regione e altri soggetti pubblici per ricerca","R",{"$f":"IF('00 Aggregatore'!$D18=\"R\",SUMIF('00 Alimenta'!$A:$A,$B18,'00 Alimenta'!D:D),SUMIF('00 Alimenta'!$A:$A,$B18,'00 Alimenta'!D:D)*-1)","v":0},{"$f":"IF('00 Aggregatore'!$D18=\"R\",SUMIF('00 Alimenta'!$A:$A,$B18,'00 Alimenta'!E:E),SUMIF('00 Alimenta'!$A:$A,$B18,'00 Alimenta'!E:E)*-1)","v":0}]
["AR","AA0220","Contributi da privati per ricerca","R",{"$f":"IF('00 Aggregatore'!$D19=\"R\",SUMIF('00 Alimenta'!$A:$A,$B19,'00 Alimenta'!D:D),SUMIF('00 Alimenta'!$A:$A,$B19,'00 Alimenta'!D:D)*-1)","v":0},{"$f":"IF('00 Aggregatore'!$D19=\"R\",SUMIF('00 Alimenta'!$A:$A,$B19,'00 Alimenta'!E:E),SUMIF('00 Alimenta'!$A:$A,$B19,'00 Alimenta'!E:E)*-1)","v":0}]
["AR","AA0230","Contributi c/esercizio da privati","R",{"$f":"IF('00 Aggregatore'!$D20=\"R\",SUMIF('00 Alimenta'!$A:$A,$B20,'00 Alimenta'!D:D),SUMIF('00 Alimenta'!$A:$A,$B20,'00 Alimenta'!D:D)*-1)","v":0},{"$f":"IF('00 Aggregatore'!$D20=\"R\",SUMIF('00 Alimenta'!$A:$A,$B20,'00 Alimenta'!E:E),SUMIF('00 Alimenta'!$A:$A,$B20,'00 Alimenta'!E:E)*-1)","v":0}]
["AR","AA0250","Rettifica contributi in c/esercizio per destinazione ad investimenti - da Regione o Provincia Autonoma per quota F.S. regionale","R",{"$f":"IF('00 Aggregatore'!$D21=\"R\",SUMIF('00 Alimenta'!$A:$A,$B21,'00 Alimenta'!D:D),SUMIF('00 Alimenta'!$A:$A,$B21,'00 Alimenta'!D:D)*-1)","v":-8787559.1099999994},{"$f":"IF('00 Aggregatore'!$D21=\"R\",SUMIF('00 Alimenta'!$A:$A,$B21,'00 Alimenta'!E:E),SUMIF('00 Alimenta'!$A:$A,$B21,'00 Alimenta'!E:E)*-1)","v":-6506318.8899999997}]
["AR","AA0260","Rettifica contributi in c/esercizio per destinazione ad investimenti - Altri contributi","R",{"$f":"IF('00 Aggregatore'!$D22=\"R\",SUMIF('00 Alimenta'!$A:$A,$B22,'00 Alimenta'!D:D),SUMIF('00 Alimenta'!$A:$A,$B22,'00 Alimenta'!D:D)*-1)","v":0},{"$f":"IF('00 Aggregatore'!$D22=\"R\",SUMIF('00 Alimenta'!$A:$A,$B22,'00 Alimenta'!E:E),SUMIF('00 Alimenta'!$A:$A,$B22,'00 Alimenta'!E:E)*-1)","v":0}]
["AR","AA0280","Utilizzo fondi per quote inutilizzate contributi di esercizi precedenti da Regione o Provincia Autonoma per quota F.S. regionale vincolato","R",{"$f":"IF('00 Aggregatore'!$D23=\"R\",SUMIF('00 Alimenta'!$A:$A,$B23,'00 Alimenta'!D:D),SUMIF('00 Alimenta'!$A:$A,$B23,'00 Alimenta'!D:D)*-1)","v":5960927.8300000001},{"$f":"IF('00 Aggregatore'!$D23=\"R\",SUMIF('00 Alimenta'!$A:$A,$B23,'00 Alimenta'!E:E),SUMIF('00 Alimenta'!$A:$A,$B23,'00 Alimenta'!E:E)*-1)","v":5681020.0999999996}]
["AR","AA0290","Utilizzo fondi per quote inutilizzate contributi di esercizi precedenti da soggetti pubblici (extra fondo) vincolati","R",{"$f":"IF('00 Aggregatore'!$D24=\"R\",SUMIF('00 Alimenta'!$A:$A,$B24,'00 Alimenta'!D:D),SUMIF('00 Alimenta'!$A:$A,$B24,'00 Alimenta'!D:D)*-1)","v":299262.65000000002},{"$f":"IF('00 Aggregatore'!$D24=\"R\",SUMIF('00 Alimenta'!$A:$A,$B24,'00 Alimenta'!E:E),SUMIF('00 Alimenta'!$A:$A,$B24,'00 Alimenta'!E:E)*-1)","v":92452.46}]
["AR","AA0300","Utilizzo fondi per quote inutilizzate contributi di esercizi precedenti per ricerca","R",{"$f":"IF('00 Aggregatore'!$D25=\"R\",SUMIF('00 Alimenta'!$A:$A,$B25,'00 Alimenta'!D:D),SUMIF('00 Alimenta'!$A:$A,$B25,'00 Alimenta'!D:D)*-1)","v":0},{"$f":"IF('00 Aggregatore'!$D25=\"R\",SUMIF('00 Alimenta'!$A:$A,$B25,'00 Alimenta'!E:E),SUMIF('00 Alimenta'!$A:$A,$B25,'00 Alimenta'!E:E)*-1)","v":0}]
["AR","AA0310","Utilizzo fondi per quote inutilizzate contributi vincolati di esercizi precedenti da privati","R",{"$f":"IF('00 Aggregatore'!$D26=\"R\",SUMIF('00 Alimenta'!$A:$A,$B26,'00 Alimenta'!D:D),SUMIF('00 Alimenta'!$A:$A,$B26,'00 Alimenta'!D:D)*-1)","v":0},{"$f":"IF('00 Aggregatore'!$D26=\"R\",SUMIF('00 Alimenta'!$A:$A,$B26,'00 Alimenta'!E:E),SUMIF('00 Alimenta'!$A:$A,$B26,'00 Alimenta'!E:E)*-1)","v":0}]
["AR","AA0350","Prestazioni di ricovero","R",{"$f":"IF('00 Aggregatore'!$D27=\"R\",SUMIF('00 Alimenta'!$A:$A,$B27,'00 Alimenta'!D:D),SUMIF('00 Alimenta'!$A:$A,$B27,'00 Alimenta'!D:D)*-1)","v":60275803.049999997},{"$f":"IF('00 Aggregatore'!$D27=\"R\",SUMIF('00 Alimenta'!$A:$A,$B27,'00 Alimenta'!E:E),SUMIF('00 Alimenta'!$A:$A,$B27,'00 Alimenta'!E:E)*-1)","v":62109937.310000002}]
["AR","AA0360","Prestazioni di specialistica ambulatoriale","R",{"$f":"IF('00 Aggregatore'!$D28=\"R\",SUMIF('00 Alimenta'!$A:$A,$B28,'00 Alimenta'!D:D),SUMIF('00 Alimenta'!$A:$A,$B28,'00 Alimenta'!D:D)*-1)","v":7784926.8200000003},{"$f":"IF('00 Aggregatore'!$D28=\"R\",SUMIF('00 Alimenta'!$A:$A,$B28,'00 Alimenta'!E:E),SUMIF('00 Alimenta'!$A:$A,$B28,'00 Alimenta'!E:E)*-1)","v":8188514.2599999998}]
["AR","AA0370","Prestazioni di psichiatria residenziale e semiresidenziale","R",{"$f":"IF('00 Aggregatore'!$D29=\"R\",SUMIF('00 Alimenta'!$A:$A,$B29,'00 Alimenta'!D:D),SUMIF('00 Alimenta'!$A:$A,$B29,'00 Alimenta'!D:D)*-1)","v":4761138.87},{"$f":"IF('00 Aggregatore'!$D29=\"R\",SUMIF('00 Alimenta'!$A:$A,$B29,'00 Alimenta'!E:E),SUMIF('00 Alimenta'!$A:$A,$B29,'00 Alimenta'!E:E)*-1)","v":4556497.3099999996}]
["AR","AA0380","Prestazioni di File F","R",{"$f":"IF('00 Aggregatore'!$D30=\"R\",SUMIF('00 Alimenta'!$A:$A,$B30,'00 Alimenta'!D:D),SUMIF('00 Alimenta'!$A:$A,$B30,'00 Alimenta'!D:D)*-1)","v":13121092.029999999},{"$f":"IF('00 Aggregatore'!$D30=\"R\",SUMIF('00 Alimenta'!$A:$A,$B30,'00 Alimenta'!E:E),SUMIF('00 Alimenta'!$A:$A,$B30,'00 Alimenta'!E:E)*-1)","v":13565690.02}]
["AR","AA0390","Prestazioni servizi MMG, PLS, Continuità assistenziale","R",{"$f":"IF('00 Aggregatore'!$D31=\"R\",SUMIF('00 Alimenta'!$A:$A,$B31,'00 Alimenta'!D:D),SUMIF('00 Alimenta'!$A:$A,$B31,'00 Alimenta'!D:D)*-1)","v":204670},{"$f":"IF('00 Aggregatore'!$D31=\"R\",SUMIF('00 Alimenta'!$A:$A,$B31,'00 Alimenta'!E:E),SUMIF('00 Alimenta'!$A:$A,$B31,'00 Alimenta'!E:E)*-1)","v":57455.65}]
["AR","AA0400","Prestazioni servizi farmaceutica convenzionata","R",{"$f":"IF('00 Aggregatore'!$D32=\"R\",SUMIF('00 Alimenta'!$A:$A,$B32,'00 Alimenta'!D:D),SUMIF('00 Alimenta'!$A:$A,$B32,'00 Alimenta'!D:D)*-1)","v":1545791.88},{"$f":"IF('00 Aggregatore'!$D32=\"R\",SUMIF('00 Alimenta'!$A:$A,$B32,'00 Alimenta'!E:E),SUMIF('00 Alimenta'!$A:$A,$B32,'00 Alimenta'!E:E)*-1)","v":1531007.26}]
["AR","AA0410","Prestazioni termali","R",{"$f":"IF('00 Aggregatore'!$D33=\"R\",SUMIF('00 Alimenta'!$A:$A,$B33,'00 Alimenta'!D:D),SUMIF('00 Alimenta'!$A:$A,$B33,'00 Alimenta'!D:D)*-1)","v":1144807.45},{"$f":"IF('00 Aggregatore'!$D33=\"R\",SUMIF('00 Alimenta'!$A:$A,$B33,'00 Alimenta'!E:E),SUMIF('00 Alimenta'!$A:$A,$B33,'00 Alimenta'!E:E)*-1)","v":1104099.8899999999}]
["AR","AA0420","Prestazioni trasporto ambulanze ed elisoccorso","R",{"$f":"IF('00 Aggregatore'!$D34=\"R\",SUMIF('00 Alimenta'!$A:$A,$B34,'00 Alimenta'!D:D),SUMIF('00 Alimenta'!$A:$A,$B34,'00 Alimenta'!D:D)*-1)","v":202243.79},{"$f":"IF('00 Aggregatore'!$D34=\"R\",SUMIF('00 Alimenta'!$A:$A,$B34,'00 Alimenta'!E:E),SUMIF('00 Alimenta'!$A:$A,$B34,'00 Alimenta'!E:E)*-1)","v":175653.51}]
["AR","AA0430","Altre prestazioni sanitarie e socio-sanitarie a rilevanza sanitaria","R",{"$f":"IF('00 Aggregatore'!$D35=\"R\",SUMIF('00 Alimenta'!$A:$A,$B35,'00 Alimenta'!D:D),SUMIF('00 Alimenta'!$A:$A,$B35,'00 Alimenta'!D:D)*-1)","v":5205198.6399999997},{"$f":"IF('00 Aggregatore'!$D35=\"R\",SUMIF('00 Alimenta'!$A:$A,$B35,'00 Alimenta'!E:E),SUMIF('00 Alimenta'!$A:$A,$B35,'00 Alimenta'!E:E)*-1)","v":5392204.3799999999}]
["AR","AA0440","Ricavi per prestazioni sanitarie e socio-sanitarie a rilevanza sanitaria erogate ad altri soggetti pubblici","R",{"$f":"IF('00 Aggregatore'!$D36=\"R\",SUMIF('00 Alimenta'!$A:$A,$B36,'00 Alimenta'!D:D),SUMIF('00 Alimenta'!$A:$A,$B36,'00 Alimenta'!D:D)*-1)","v":40778.15},{"$f":"IF('00 Aggregatore'!$D36=\"R\",SUMIF('00 Alimenta'!$A:$A,$B36,'00 Alimenta'!E:E),SUMIF('00 Alimenta'!$A:$A,$B36,'00 Alimenta'!E:E)*-1)","v":45364.98}]
["AR","AA0460","Prestazioni di ricovero","R",{"$f":"IF('00 Aggregatore'!$D37=\"R\",SUMIF('00 Alimenta'!$A:$A,$B37,'00 Alimenta'!D:D),SUMIF('00 Alimenta'!$A:$A,$B37,'00 Alimenta'!D:D)*-1)","v":6326378.1500000004},{"$f":"IF('00 Aggregatore'!$D37=\"R\",SUMIF('00 Alimenta'!$A:$A,$B37,'00 Alimenta'!E:E),SUMIF('00 Alimenta'!$A:$A,$B37,'00 Alimenta'!E:E)*-1)","v":1554681.22}]
["AR","AA0470","Prestazioni ambulatoriali","R",{"$f":"IF('00 Aggregatore'!$D38=\"R\",SUMIF('00 Alimenta'!$A:$A,$B38,'00 Alimenta'!D:D),SUMIF('00 Alimenta'!$A:$A,$B38,'00 Alimenta'!D:D)*-1)","v":1809228.39},{"$f":"IF('00 Aggregatore'!$D38=\"R\",SUMIF('00 Alimenta'!$A:$A,$B38,'00 Alimenta'!E:E),SUMIF('00 Alimenta'!$A:$A,$B38,'00 Alimenta'!E:E)*-1)","v":851774.85}]
["AR","AA0480","Prestazioni di psichiatria non soggetta a compensazione (residenziale e semiresidenziale)","R",{"$f":"IF('00 Aggregatore'!$D39=\"R\",SUMIF('00 Alimenta'!$A:$A,$B39,'00 Alimenta'!D:D),SUMIF('00 Alimenta'!$A:$A,$B39,'00 Alimenta'!D:D)*-1)","v":0},{"$f":"IF('00 Aggregatore'!$D39=\"R\",SUMIF('00 Alimenta'!$A:$A,$B39,'00 Alimenta'!E:E),SUMIF('00 Alimenta'!$A:$A,$B39,'00 Alimenta'!E:E)*-1)","v":0}]
["AR","AA0490","Prestazioni di File F","R",{"$f":"IF('00 Aggregatore'!$D40=\"R\",SUMIF('00 Alimenta'!$A:$A,$B40,'00 Alimenta'!D:D),SUMIF('00 Alimenta'!$A:$A,$B40,'00 Alimenta'!D:D)*-1)","v":972613.7},{"$f":"IF('00 Aggregatore'!$D40=\"R\",SUMIF('00 Alimenta'!$A:$A,$B40,'00 Alimenta'!E:E),SUMIF('00 Alimenta'!$A:$A,$B40,'00 Alimenta'!E:E)*-1)","v":1604980.14}]
["AR","AA0500","Prestazioni servizi MMG, PLS, Continuità assistenziale extra Regione","R",{"$f":"IF('00 Aggregatore'!$D41=\"R\",SUMIF('00 Alimenta'!$A:$A,$B41,'00 Alimenta'!D:D),SUMIF('00 Alimenta'!$A:$A,$B41,'00 Alimenta'!D:D)*-1)","v":155741.96},{"$f":"IF('00 Aggregatore'!$D41=\"R\",SUMIF('00 Alimenta'!$A:$A,$B41,'00 Alimenta'!E:E),SUMIF('00 Alimenta'!$A:$A,$B41,'00 Alimenta'!E:E)*-1)","v":119388.84}]
["AR","AA0510","Prestazioni servizi farmaceutica convenzionata extra Regione","R",{"$f":"IF('00 Aggregatore'!$D42=\"R\",SUMIF('00 Alimenta'!$A:$A,$B42,'00 Alimenta'!D:D),SUMIF('00 Alimenta'!$A:$A,$B42,'00 Alimenta'!D:D)*-1)","v":523609.47},{"$f":"IF('00 Aggregatore'!$D42=\"R\",SUMIF('00 Alimenta'!$A:$A,$B42,'00 Alimenta'!E:E),SUMIF('00 Alimenta'!$A:$A,$B42,'00 Alimenta'!E:E)*-1)","v":502038.11}]
["AR","AA0520","Prestazioni termali extra Regione","R",{"$f":"IF('00 Aggregatore'!$D43=\"R\",SUMIF('00 Alimenta'!$A:$A,$B43,'00 Alimenta'!D:D),SUMIF('00 Alimenta'!$A:$A,$B43,'00 Alimenta'!D:D)*-1)","v":332335.62},{"$f":"IF('00 Aggregatore'!$D43=\"R\",SUMIF('00 Alimenta'!$A:$A,$B43,'00 Alimenta'!E:E),SUMIF('00 Alimenta'!$A:$A,$B43,'00 Alimenta'!E:E)*-1)","v":172275.4}]
["AR","AA0530","Prestazioni trasporto ambulanze ed elisoccorso extra Regione","R",{"$f":"IF('00 Aggregatore'!$D44=\"R\",SUMIF('00 Alimenta'!$A:$A,$B44,'00 Alimenta'!D:D),SUMIF('00 Alimenta'!$A:$A,$B44,'00 Alimenta'!D:D)*-1)","v":267907.44},{"$f":"IF('00 Aggregatore'!$D44=\"R\",SUMIF('00 Alimenta'!$A:$A,$B44,'00 Alimenta'!E:E),SUMIF('00 Alimenta'!$A:$A,$B44,'00 Alimenta'!E:E)*-1)","v":512404.02}]
["AR","AA0540","Altre prestazioni sanitarie e socio-sanitarie a rilevanza sanitaria extra Regione","R",{"$f":"IF('00 Aggregatore'!$D45=\"R\",SUMIF('00 Alimenta'!$A:$A,$B45,'00 Alimenta'!D:D),SUMIF('00 Alimenta'!$A:$A,$B45,'00 Alimenta'!D:D)*-1)","v":0},{"$f":"IF('00 Aggregatore'!$D45=\"R\",SUMIF('00 Alimenta'!$A:$A,$B45,'00 Alimenta'!E:E),SUMIF('00 Alimenta'!$A:$A,$B45,'00 Alimenta'!E:E)*-1)","v":0}]
["AR","AA0550","Ricavi per cessione di emocomponenti e cellule staminali extra Regione","R",{"$f":"IF('00 Aggregatore'!$D46=\"R\",SUMIF('00 Alimenta'!$A:$A,$B46,'00 Alimenta'!D:D),SUMIF('00 Alimenta'!$A:$A,$B46,'00 Alimenta'!D:D)*-1)","v":813},{"$f":"IF('00 Aggregatore'!$D46=\"R\",SUMIF('00 Alimenta'!$A:$A,$B46,'00 Alimenta'!E:E),SUMIF('00 Alimenta'!$A:$A,$B46,'00 Alimenta'!E:E)*-1)","v":174766.05}]
["AR","AA0560","Ricavi per differenziale tariffe TUC","R",{"$f":"IF('00 Aggregatore'!$D47=\"R\",SUMIF('00 Alimenta'!$A:$A,$B47,'00 Alimenta'!D:D),SUMIF('00 Alimenta'!$A:$A,$B47,'00 Alimenta'!D:D)*-1)","v":0},{"$f":"IF('00 Aggregatore'!$D47=\"R\",SUMIF('00 Alimenta'!$A:$A,$B47,'00 Alimenta'!E:E),SUMIF('00 Alimenta'!$A:$A,$B47,'00 Alimenta'!E:E)*-1)","v":0}]
["AR","AA0580","Prestazioni di assistenza riabilitativa non soggette a compensazione extra Regione","R",{"$f":"IF('00 Aggregatore'!$D48=\"R\",SUMIF('00 Alimenta'!$A:$A,$B48,'00 Alimenta'!D:D),SUMIF('00 Alimenta'!$A:$A,$B48,'00 Alimenta'!D:D)*-1)","v":1860.9},{"$f":"IF('00 Aggregatore'!$D48=\"R\",SUMIF('00 Alimenta'!$A:$A,$B48,'00 Alimenta'!E:E),SUMIF('00 Alimenta'!$A:$A,$B48,'00 Alimenta'!E:E)*-1)","v":0}]
["AR","AA0590","Altre prestazioni sanitarie e socio-sanitarie a rilevanza sanitaria non soggette a compensazione extra Regione","R",{"$f":"IF('00 Aggregatore'!$D49=\"R\",SUMIF('00 Alimenta'!$A:$A,$B49,'00 Alimenta'!D:D),SUMIF('00 Alimenta'!$A:$A,$B49,'00 Alimenta'!D:D)*-1)","v":45933.3},{"$f":"IF('00 Aggregatore'!$D49=\"R\",SUMIF('00 Alimenta'!$A:$A,$B49,'00 Alimenta'!E:E),SUMIF('00 Alimenta'!$A:$A,$B49,'00 Alimenta'!E:E)*-1)","v":1696.8}]
["AR","AA0600","Altre prestazioni sanitarie a rilevanza sanitaria - Mobilità attiva internazionale","R",{"$f":"IF('00 Aggregatore'!$D50=\"R\",SUMIF('00 Alimenta'!$A:$A,$B50,'00 Alimenta'!D:D),SUMIF('00 Alimenta'!$A:$A,$B50,'00 Alimenta'!D:D)*-1)","v":0},{"$f":"IF('00 Aggregatore'!$D50=\"R\",SUMIF('00 Alimenta'!$A:$A,$B50,'00 Alimenta'!E:E),SUMIF('00 Alimenta'!$A:$A,$B50,'00 Alimenta'!E:E)*-1)","v":0}]
["AR","AA0620","Prestazioni di ricovero da privati extra Regione in compensazione (mobilità attiva)","R",{"$f":"IF('00 Aggregatore'!$D51=\"R\",SUMIF('00 Alimenta'!$A:$A,$B51,'00 Alimenta'!D:D),SUMIF('00 Alimenta'!$A:$A,$B51,'00 Alimenta'!D:D)*-1)","v":11496977.640000001},{"$f":"IF('00 Aggregatore'!$D51=\"R\",SUMIF('00 Alimenta'!$A:$A,$B51,'00 Alimenta'!E:E),SUMIF('00 Alimenta'!$A:$A,$B51,'00 Alimenta'!E:E)*-1)","v":11917704.07}]
["AR","AA0630","Prestazioni ambulatoriali da privati extra Regione in compensazione (mobilità attiva)","R",{"$f":"IF('00 Aggregatore'!$D52=\"R\",SUMIF('00 Alimenta'!$A:$A,$B52,'00 Alimenta'!D:D),SUMIF('00 Alimenta'!$A:$A,$B52,'00 Alimenta'!D:D)*-1)","v":202279.88},{"$f":"IF('00 Aggregatore'!$D52=\"R\",SUMIF('00 Alimenta'!$A:$A,$B52,'00 Alimenta'!E:E),SUMIF('00 Alimenta'!$A:$A,$B52,'00 Alimenta'!E:E)*-1)","v":218419.7}]
["AR","AA0640","Prestazioni di File F da privati extra Regione in compensazione (mobilità attiva)","R",{"$f":"IF('00 Aggregatore'!$D53=\"R\",SUMIF('00 Alimenta'!$A:$A,$B53,'00 Alimenta'!D:D),SUMIF('00 Alimenta'!$A:$A,$B53,'00 Alimenta'!D:D)*-1)","v":0},{"$f":"IF('00 Aggregatore'!$D53=\"R\",SUMIF('00 Alimenta'!$A:$A,$B53,'00 Alimenta'!E:E),SUMIF('00 Alimenta'!$A:$A,$B53,'00 Alimenta'!E:E)*-1)","v":0}]
["AR","AA0650","Altre prestazioni sanitarie e socio-sanitarie a rilevanza sanitaria erogate da privati v/residenti extra Regione in compensazione (mobilità attiva)","R",{"$f":"IF('00 Aggregatore'!$D54=\"R\",SUMIF('00 Alimenta'!$A:$A,$B54,'00 Alimenta'!D:D),SUMIF('00 Alimenta'!$A:$A,$B54,'00 Alimenta'!D:D)*-1)","v":0},{"$f":"IF('00 Aggregatore'!$D54=\"R\",SUMIF('00 Alimenta'!$A:$A,$B54,'00 Alimenta'!E:E),SUMIF('00 Alimenta'!$A:$A,$B54,'00 Alimenta'!E:E)*-1)","v":0}]
["AR","AA0660","Ricavi per prestazioni sanitarie e socio-sanitarie a rilevanza sanitaria erogate a privati","R",{"$f":"IF('00 Aggregatore'!$D55=\"R\",SUMIF('00 Alimenta'!$A:$A,$B55,'00 Alimenta'!D:D),SUMIF('00 Alimenta'!$A:$A,$B55,'00 Alimenta'!D:D)*-1)","v":3531032.8499999996},{"$f":"IF('00 Aggregatore'!$D55=\"R\",SUMIF('00 Alimenta'!$A:$A,$B55,'00 Alimenta'!E:E),SUMIF('00 Alimenta'!$A:$A,$B55,'00 Alimenta'!E:E)*-1)","v":3569406.3100000005}]
["AR","AA0680","Ricavi per prestazioni sanitarie intramoenia - Area ospedaliera","R",{"$f":"IF('00 Aggregatore'!$D56=\"R\",SUMIF('00 Alimenta'!$A:$A,$B56,'00 Alimenta'!D:D),SUMIF('00 Alimenta'!$A:$A,$B56,'00 Alimenta'!D:D)*-1)","v":89330.21},{"$f":"IF('00 Aggregatore'!$D56=\"R\",SUMIF('00 Alimenta'!$A:$A,$B56,'00 Alimenta'!E:E),SUMIF('00 Alimenta'!$A:$A,$B56,'00 Alimenta'!E:E)*-1)","v":50045.82}]
["AR","AA0690","Ricavi per prestazioni sanitarie intramoenia - Area specialistica","R",{"$f":"IF('00 Aggregatore'!$D57=\"R\",SUMIF('00 Alimenta'!$A:$A,$B57,'00 Alimenta'!D:D),SUMIF('00 Alimenta'!$A:$A,$B57,'00 Alimenta'!D:D)*-1)","v":3216315.61},{"$f":"IF('00 Aggregatore'!$D57=\"R\",SUMIF('00 Alimenta'!$A:$A,$B57,'00 Alimenta'!E:E),SUMIF('00 Alimenta'!$A:$A,$B57,'00 Alimenta'!E:E)*-1)","v":3252006}]
["AR","AA0700","Ricavi per prestazioni sanitarie intramoenia - Area sanità pubblica","R",{"$f":"IF('00 Aggregatore'!$D58=\"R\",SUMIF('00 Alimenta'!$A:$A,$B58,'00 Alimenta'!D:D),SUMIF('00 Alimenta'!$A:$A,$B58,'00 Alimenta'!D:D)*-1)","v":19348.810000000001},{"$f":"IF('00 Aggregatore'!$D58=\"R\",SUMIF('00 Alimenta'!$A:$A,$B58,'00 Alimenta'!E:E),SUMIF('00 Alimenta'!$A:$A,$B58,'00 Alimenta'!E:E)*-1)","v":22414.54}]
["AR","AA0710","Ricavi per prestazioni sanitarie intramoenia - Consulenze (ex art. 55 c.1 lett. c), d) ed ex art. 57-58)","R",{"$f":"IF('00 Aggregatore'!$D59=\"R\",SUMIF('00 Alimenta'!$A:$A,$B59,'00 Alimenta'!D:D),SUMIF('00 Alimenta'!$A:$A,$B59,'00 Alimenta'!D:D)*-1)","v":520863.67},{"$f":"IF('00 Aggregatore'!$D59=\"R\",SUMIF('00 Alimenta'!$A:$A,$B59,'00 Alimenta'!E:E),SUMIF('00 Alimenta'!$A:$A,$B59,'00 Alimenta'!E:E)*-1)","v":478823.7}]
["AR","AA0720","Ricavi per prestazioni sanitarie intramoenia - Consulenze (ex art. 55 c.1 lett. c), d) ed ex art. 57-58) (Aziende sanitarie pubbliche della Regione)","R",{"$f":"IF('00 Aggregatore'!$D60=\"R\",SUMIF('00 Alimenta'!$A:$A,$B60,'00 Alimenta'!D:D),SUMIF('00 Alimenta'!$A:$A,$B60,'00 Alimenta'!D:D)*-1)","v":0},{"$f":"IF('00 Aggregatore'!$D60=\"R\",SUMIF('00 Alimenta'!$A:$A,$B60,'00 Alimenta'!E:E),SUMIF('00 Alimenta'!$A:$A,$B60,'00 Alimenta'!E:E)*-1)","v":0}]
["AR","AA0730","Ricavi per prestazioni sanitarie intramoenia - Altro","R",{"$f":"IF('00 Aggregatore'!$D61=\"R\",SUMIF('00 Alimenta'!$A:$A,$B61,'00 Alimenta'!D:D),SUMIF('00 Alimenta'!$A:$A,$B61,'00 Alimenta'!D:D)*-1)","v":109709.92},{"$f":"IF('00 Aggregatore'!$D61=\"R\",SUMIF('00 Alimenta'!$A:$A,$B61,'00 Alimenta'!E:E),SUMIF('00 Alimenta'!$A:$A,$B61,'00 Alimenta'!E:E)*-1)","v":97870.17}]
["AR","AA0740","Ricavi per prestazioni sanitarie intramoenia - Altro (Aziende sanitarie pubbliche della Regione)","R",{"$f":"IF('00 Aggregatore'!$D62=\"R\",SUMIF('00 Alimenta'!$A:$A,$B62,'00 Alimenta'!D:D),SUMIF('00 Alimenta'!$A:$A,$B62,'00 Alimenta'!D:D)*-1)","v":0},{"$f":"IF('00 Aggregatore'!$D62=\"R\",SUMIF('00 Alimenta'!$A:$A,$B62,'00 Alimenta'!E:E),SUMIF('00 Alimenta'!$A:$A,$B62,'00 Alimenta'!E:E)*-1)","v":18272.099999999999}]
["AR","AA0760","Rimborsi assicurativi","R",{"$f":"IF('00 Aggregatore'!$D63=\"R\",SUMIF('00 Alimenta'!$A:$A,$B63,'00 Alimenta'!D:D),SUMIF('00 Alimenta'!$A:$A,$B63,'00 Alimenta'!D:D)*-1)","v":570386.93999999994},{"$f":"IF('00 Aggregatore'!$D63=\"R\",SUMIF('00 Alimenta'!$A:$A,$B63,'00 Alimenta'!E:E),SUMIF('00 Alimenta'!$A:$A,$B63,'00 Alimenta'!E:E)*-1)","v":166973.67000000001}]
["AR","AA0780","Rimborso degli oneri stipendiali del personale dell'Azienda in posizione di comando presso la Regione","R",{"$f":"IF('00 Aggregatore'!$D64=\"R\",SUMIF('00 Alimenta'!$A:$A,$B64,'00 Alimenta'!D:D),SUMIF('00 Alimenta'!$A:$A,$B64,'00 Alimenta'!D:D)*-1)","v":0},{"$f":"IF('00 Aggregatore'!$D64=\"R\",SUMIF('00 Alimenta'!$A:$A,$B64,'00 Alimenta'!E:E),SUMIF('00 Alimenta'!$A:$A,$B64,'00 Alimenta'!E:E)*-1)","v":0}]
["AR","AA0790","Altri concorsi, recuperi e rimborsi da parte della Regione","R",{"$f":"IF('00 Aggregatore'!$D65=\"R\",SUMIF('00 Alimenta'!$A:$A,$B65,'00 Alimenta'!D:D),SUMIF('00 Alimenta'!$A:$A,$B65,'00 Alimenta'!D:D)*-1)","v":0},{"$f":"IF('00 Aggregatore'!$D65=\"R\",SUMIF('00 Alimenta'!$A:$A,$B65,'00 Alimenta'!E:E),SUMIF('00 Alimenta'!$A:$A,$B65,'00 Alimenta'!E:E)*-1)","v":0}]
["AR","AA0810","Rimborso degli oneri stipendiali del personale dipendente dell'Azienda in posizione di comando presso Aziende sanitarie pubbliche della Regione","R",{"$f":"IF('00 Aggregatore'!$D66=\"R\",SUMIF('00 Alimenta'!$A:$A,$B66,'00 Alimenta'!D:D),SUMIF('00 Alimenta'!$A:$A,$B66,'00 Alimenta'!D:D)*-1)","v":0},{"$f":"IF('00 Aggregatore'!$D66=\"R\",SUMIF('00 Alimenta'!$A:$A,$B66,'00 Alimenta'!E:E),SUMIF('00 Alimenta'!$A:$A,$B66,'00 Alimenta'!E:E)*-1)","v":14346.46}]
["AR","AA0820","Rimborsi per acquisto beni da parte di Aziende sanitarie pubbliche della Regione","R",{"$f":"IF('00 Aggregatore'!$D67=\"R\",SUMIF('00 Alimenta'!$A:$A,$B67,'00 Alimenta'!D:D),SUMIF('00 Alimenta'!$A:$A,$B67,'00 Alimenta'!D:D)*-1)","v":0},{"$f":"IF('00 Aggregatore'!$D67=\"R\",SUMIF('00 Alimenta'!$A:$A,$B67,'00 Alimenta'!E:E),SUMIF('00 Alimenta'!$A:$A,$B67,'00 Alimenta'!E:E)*-1)","v":0}]
["AR","AA0830","Altri concorsi, recuperi e rimborsi da parte di Aziende sanitarie pubbliche della Regione","R",{"$f":"IF('00 Aggregatore'!$D68=\"R\",SUMIF('00 Alimenta'!$A:$A,$B68,'00 Alimenta'!D:D),SUMIF('00 Alimenta'!$A:$A,$B68,'00 Alimenta'!D:D)*-1)","v":142391.67000000001},{"$f":"IF('00 Aggregatore'!$D68=\"R\",SUMIF('00 Alimenta'!$A:$A,$B68,'00 Alimenta'!E:E),SUMIF('00 Alimenta'!$A:$A,$B68,'00 Alimenta'!E:E)*-1)","v":135883.64000000001}]
["AR","AA0850","Rimborso degli oneri stipendiali del personale dipendente dell'Azienda in posizione di comando presso altri soggetti pubblici","R",{"$f":"IF('00 Aggregatore'!$D69=\"R\",SUMIF('00 Alimenta'!$A:$A,$B69,'00 Alimenta'!D:D),SUMIF('00 Alimenta'!$A:$A,$B69,'00 Alimenta'!D:D)*-1)","v":117798.94},{"$f":"IF('00 Aggregatore'!$D69=\"R\",SUMIF('00 Alimenta'!$A:$A,$B69,'00 Alimenta'!E:E),SUMIF('00 Alimenta'!$A:$A,$B69,'00 Alimenta'!E:E)*-1)","v":114750.81}]
[{"$f":"LEFT(B70,1)&D70","v":"AR"},"AA0860","Rimborsi per acquisto beni da parte di altri soggetti pubblici","R",{"$f":"IF('00 Aggregatore'!$D70=\"R\",SUMIF('00 Alimenta'!$A:$A,$B70,'00 Alimenta'!D:D),SUMIF('00 Alimenta'!$A:$A,$B70,'00 Alimenta'!D:D)*-1)","v":19160.62},{"$f":"IF('00 Aggregatore'!$D70=\"R\",SUMIF('00 Alimenta'!$A:$A,$B70,'00 Alimenta'!E:E),SUMIF('00 Alimenta'!$A:$A,$B70,'00 Alimenta'!E:E)*-1)","v":14709.64}]
["AR","AA0870","Altri concorsi, recuperi e rimborsi da parte di altri soggetti pubblici","R",{"$f":"IF('00 Aggregatore'!$D71=\"R\",SUMIF('00 Alimenta'!$A:$A,$B71,'00 Alimenta'!D:D),SUMIF('00 Alimenta'!$A:$A,$B71,'00 Alimenta'!D:D)*-1)","v":4510.3100000000004},{"$f":"IF('00 Aggregatore'!$D71=\"R\",SUMIF('00 Alimenta'!$A:$A,$B71,'00 Alimenta'!E:E),SUMIF('00 Alimenta'!$A:$A,$B71,'00 Alimenta'!E:E)*-1)","v":157670.22}]
["AR","AA0900","Pay-back per il superamento del tetto della spesa farmaceutica territoriale","R",{"$f":"IF('00 Aggregatore'!$D72=\"R\",SUMIF('00 Alimenta'!$A:$A,$B72,'00 Alimenta'!D:D),SUMIF('00 Alimenta'!$A:$A,$B72,'00 Alimenta'!D:D)*-1)","v":0},{"$f":"IF('00 Aggregatore'!$D72=\"R\",SUMIF('00 Alimenta'!$A:$A,$B72,'00 Alimenta'!E:E),SUMIF('00 Alimenta'!$A:$A,$B72,'00 Alimenta'!E:E)*-1)","v":0}]
["AR","AA0910","Pay-back per superamento del tetto della spesa farmaceutica ospedaliera","R",{"$f":"IF('00 Aggregatore'!$D73=\"R\",SUMIF('00 Alimenta'!$A:$A,$B73,'00 Alimenta'!D:D),SUMIF('00 Alimenta'!$A:$A,$B73,'00 Alimenta'!D:D)*-1)","v":0},{"$f":"IF('00 Aggregatore'!$D73=\"R\",SUMIF('00 Alimenta'!$A:$A,$B73,'00 Alimenta'!E:E),SUMIF('00 Alimenta'!$A:$A,$B73,'00 Alimenta'!E:E)*-1)","v":20}]
["AR","AA0920","Ulteriore Pay-back","R",{"$f":"IF('00 Aggregatore'!$D74=\"R\",SUMIF('00 Alimenta'!$A:$A,$B74,'00 Alimenta'!D:D),SUMIF('00 Alimenta'!$A:$A,$B74,'00 Alimenta'!D:D)*-1)","v":1431892.14},{"$f":"IF('00 Aggregatore'!$D74=\"R\",SUMIF('00 Alimenta'!$A:$A,$B74,'00 Alimenta'!E:E),SUMIF('00 Alimenta'!$A:$A,$B74,'00 Alimenta'!E:E)*-1)","v":3426932.4}]
["AR","AA0930","Altri concorsi, recuperi e rimborsi da privati","R",{"$f":"IF('00 Aggregatore'!$D75=\"R\",SUMIF('00 Alimenta'!$A:$A,$B75,'00 Alimenta'!D:D),SUMIF('00 Alimenta'!$A:$A,$B75,'00 Alimenta'!D:D)*-1)","v":674491.36},{"$f":"IF('00 Aggregatore'!$D75=\"R\",SUMIF('00 Alimenta'!$A:$A,$B75,'00 Alimenta'!E:E),SUMIF('00 Alimenta'!$A:$A,$B75,'00 Alimenta'!E:E)*-1)","v":866980.31}]
["AR","AA0950","Compartecipazione alla spesa per prestazioni sanitarie - Ticket sulle prestazioni di specialistica ambulatoriale","R",{"$f":"IF('00 Aggregatore'!$D76=\"R\",SUMIF('00 Alimenta'!$A:$A,$B76,'00 Alimenta'!D:D),SUMIF('00 Alimenta'!$A:$A,$B76,'00 Alimenta'!D:D)*-1)","v":6032018.4100000001},{"$f":"IF('00 Aggregatore'!$D76=\"R\",SUMIF('00 Alimenta'!$A:$A,$B76,'00 Alimenta'!E:E),SUMIF('00 Alimenta'!$A:$A,$B76,'00 Alimenta'!E:E)*-1)","v":6414769.3200000003}]
["AR","AA0960","Compartecipazione alla spesa per prestazioni sanitarie - Ticket sul pronto soccorso","R",{"$f":"IF('00 Aggregatore'!$D77=\"R\",SUMIF('00 Alimenta'!$A:$A,$B77,'00 Alimenta'!D:D),SUMIF('00 Alimenta'!$A:$A,$B77,'00 Alimenta'!D:D)*-1)","v":567331.92000000004},{"$f":"IF('00 Aggregatore'!$D77=\"R\",SUMIF('00 Alimenta'!$A:$A,$B77,'00 Alimenta'!E:E),SUMIF('00 Alimenta'!$A:$A,$B77,'00 Alimenta'!E:E)*-1)","v":330322.76}]
["AR","AA0970","Compartecipazione alla spesa per prestazioni sanitarie (Ticket) - Altro","R",{"$f":"IF('00 Aggregatore'!$D78=\"R\",SUMIF('00 Alimenta'!$A:$A,$B78,'00 Alimenta'!D:D),SUMIF('00 Alimenta'!$A:$A,$B78,'00 Alimenta'!D:D)*-1)","v":0},{"$f":"IF('00 Aggregatore'!$D78=\"R\",SUMIF('00 Alimenta'!$A:$A,$B78,'00 Alimenta'!E:E),SUMIF('00 Alimenta'!$A:$A,$B78,'00 Alimenta'!E:E)*-1)","v":0}]
["AR","AA0990","Quota imputata all'esercizio dei finanziamenti per investimenti dallo Stato","R",{"$f":"IF('00 Aggregatore'!$D79=\"R\",SUMIF('00 Alimenta'!$A:$A,$B79,'00 Alimenta'!D:D),SUMIF('00 Alimenta'!$A:$A,$B79,'00 Alimenta'!D:D)*-1)","v":55380.81},{"$f":"IF('00 Aggregatore'!$D79=\"R\",SUMIF('00 Alimenta'!$A:$A,$B79,'00 Alimenta'!E:E),SUMIF('00 Alimenta'!$A:$A,$B79,'00 Alimenta'!E:E)*-1)","v":48286.07}]
["AR","AA1000","Quota imputata all'esercizio dei finanziamenti per investimenti da Regione","R",{"$f":"IF('00 Aggregatore'!$D80=\"R\",SUMIF('00 Alimenta'!$A:$A,$B80,'00 Alimenta'!D:D),SUMIF('00 Alimenta'!$A:$A,$B80,'00 Alimenta'!D:D)*-1)","v":1574332.01},{"$f":"IF('00 Aggregatore'!$D80=\"R\",SUMIF('00 Alimenta'!$A:$A,$B80,'00 Alimenta'!E:E),SUMIF('00 Alimenta'!$A:$A,$B80,'00 Alimenta'!E:E)*-1)","v":1468544.84}]
["AR","AA1010","Quota imputata all'esercizio dei finanziamenti per beni di prima dotazione","R",{"$f":"IF('00 Aggregatore'!$D81=\"R\",SUMIF('00 Alimenta'!$A:$A,$B81,'00 Alimenta'!D:D),SUMIF('00 Alimenta'!$A:$A,$B81,'00 Alimenta'!D:D)*-1)","v":3577467.93},{"$f":"IF('00 Aggregatore'!$D81=\"R\",SUMIF('00 Alimenta'!$A:$A,$B81,'00 Alimenta'!E:E),SUMIF('00 Alimenta'!$A:$A,$B81,'00 Alimenta'!E:E)*-1)","v":3577467.93}]
["AR","AA1020","Quota imputata all'esercizio dei contributi in c/esercizio FSR destinati ad investimenti","R",{"$f":"IF('00 Aggregatore'!$D82=\"R\",SUMIF('00 Alimenta'!$A:$A,$B82,'00 Alimenta'!D:D),SUMIF('00 Alimenta'!$A:$A,$B82,'00 Alimenta'!D:D)*-1)","v":3299309.48},{"$f":"IF('00 Aggregatore'!$D82=\"R\",SUMIF('00 Alimenta'!$A:$A,$B82,'00 Alimenta'!E:E),SUMIF('00 Alimenta'!$A:$A,$B82,'00 Alimenta'!E:E)*-1)","v":4730694.3099999996}]
["AR","AA1030","Quota imputata all'esercizio degli altri contributi in c/esercizio destinati ad investimenti","R",{"$f":"IF('00 Aggregatore'!$D83=\"R\",SUMIF('00 Alimenta'!$A:$A,$B83,'00 Alimenta'!D:D),SUMIF('00 Alimenta'!$A:$A,$B83,'00 Alimenta'!D:D)*-1)","v":0},{"$f":"IF('00 Aggregatore'!$D83=\"R\",SUMIF('00 Alimenta'!$A:$A,$B83,'00 Alimenta'!E:E),SUMIF('00 Alimenta'!$A:$A,$B83,'00 Alimenta'!E:E)*-1)","v":0}]
["AR","AA1040","Quota imputata all'esercizio di altre poste del patrimonio netto","R",{"$f":"IF('00 Aggregatore'!$D84=\"R\",SUMIF('00 Alimenta'!$A:$A,$B84,'00 Alimenta'!D:D),SUMIF('00 Alimenta'!$A:$A,$B84,'00 Alimenta'!D:D)*-1)","v":0},{"$f":"IF('00 Aggregatore'!$D84=\"R\",SUMIF('00 Alimenta'!$A:$A,$B84,'00 Alimenta'!E:E),SUMIF('00 Alimenta'!$A:$A,$B84,'00 Alimenta'!E:E)*-1)","v":0}]
["AR","AA1050","Incrementi delle immobilizzazioni per lavori interni","R",{"$f":"IF('00 Aggregatore'!$D85=\"R\",SUMIF('00 Alimenta'!$A:$A,$B85,'00 Alimenta'!D:D),SUMIF('00 Alimenta'!$A:$A,$B85,'00 Alimenta'!D:D)*-1)","v":0},{"$f":"IF('00 Aggregatore'!$D85=\"R\",SUMIF('00 Alimenta'!$A:$A,$B85,'00 Alimenta'!E:E),SUMIF('00 Alimenta'!$A:$A,$B85,'00 Alimenta'!E:E)*-1)","v":0}]
["AR","AA1070","Ricavi per prestazioni non sanitarie","R",{"$f":"IF('00 Aggregatore'!$D86=\"R\",SUMIF('00 Alimenta'!$A:$A,$B86,'00 Alimenta'!D:D),SUMIF('00 Alimenta'!$A:$A,$B86,'00 Alimenta'!D:D)*-1)","v":3563},{"$f":"IF('00 Aggregatore'!$D86=\"R\",SUMIF('00 Alimenta'!$A:$A,$B86,'00 Alimenta'!E:E),SUMIF('00 Alimenta'!$A:$A,$B86,'00 Alimenta'!E:E)*-1)","v":3023.66}]
["AR","AA1080","Fitti attivi e altri proventi da attività immobiliari","R",{"$f":"IF('00 Aggregatore'!$D87=\"R\",SUMIF('00 Alimenta'!$A:$A,$B87,'00 Alimenta'!D:D),SUMIF('00 Alimenta'!$A:$A,$B87,'00 Alimenta'!D:D)*-1)","v":221554.44},{"$f":"IF('00 Aggregatore'!$D87=\"R\",SUMIF('00 Alimenta'!$A:$A,$B87,'00 Alimenta'!E:E),SUMIF('00 Alimenta'!$A:$A,$B87,'00 Alimenta'!E:E)*-1)","v":221560.64}]
["AR","AA1090","Altri proventi diversi","R",{"$f":"IF('00 Aggregatore'!$D88=\"R\",SUMIF('00 Alimenta'!$A:$A,$B88,'00 Alimenta'!D:D),SUMIF('00 Alimenta'!$A:$A,$B88,'00 Alimenta'!D:D)*-1)","v":309449.19},{"$f":"IF('00 Aggregatore'!$D88=\"R\",SUMIF('00 Alimenta'!$A:$A,$B88,'00 Alimenta'!E:E),SUMIF('00 Alimenta'!$A:$A,$B88,'00 Alimenta'!E:E)*-1)","v":397717.1}]
["BC","BA0040","Medicinali con AIC, ad eccezione di vaccini ed emoderivati di produzione regionale","C",{"$f":"IF('00 Aggregatore'!$D89=\"R\",SUMIF('00 Alimenta'!$A:$A,$B89,'00 Alimenta'!D:D),SUMIF('00 Alimenta'!$A:$A,$B89,'00 Alimenta'!D:D)*-1)","v":66456835.450000003},{"$f":"IF('00 Aggregatore'!$D89=\"R\",SUMIF('00 Alimenta'!$A:$A,$B89,'00 Alimenta'!E:E),SUMIF('00 Alimenta'!$A:$A,$B89,'00 Alimenta'!E:E)*-1)","v":69235809.470000014}]
["BC","BA0050","Medicinali senza AIC","C",{"$f":"IF('00 Aggregatore'!$D90=\"R\",SUMIF('00 Alimenta'!$A:$A,$B90,'00 Alimenta'!D:D),SUMIF('00 Alimenta'!$A:$A,$B90,'00 Alimenta'!D:D)*-1)","v":1300987.46},{"$f":"IF('00 Aggregatore'!$D90=\"R\",SUMIF('00 Alimenta'!$A:$A,$B90,'00 Alimenta'!E:E),SUMIF('00 Alimenta'!$A:$A,$B90,'00 Alimenta'!E:E)*-1)","v":722585.84}]
["BC","BA0060","Emoderivati di produzione regionale","C",{"$f":"IF('00 Aggregatore'!$D91=\"R\",SUMIF('00 Alimenta'!$A:$A,$B91,'00 Alimenta'!D:D),SUMIF('00 Alimenta'!$A:$A,$B91,'00 Alimenta'!D:D)*-1)","v":0},{"$f":"IF('00 Aggregatore'!$D91=\"R\",SUMIF('00 Alimenta'!$A:$A,$B91,'00 Alimenta'!E:E),SUMIF('00 Alimenta'!$A:$A,$B91,'00 Alimenta'!E:E)*-1)","v":0}]
["BC","BA0080","da pubblico (Aziende sanitarie pubbliche della Regione) - Mobilità intraregionale","C",{"$f":"IF('00 Aggregatore'!$D92=\"R\",SUMIF('00 Alimenta'!$A:$A,$B92,'00 Alimenta'!D:D),SUMIF('00 Alimenta'!$A:$A,$B92,'00 Alimenta'!D:D)*-1)","v":0},{"$f":"IF('00 Aggregatore'!$D92=\"R\",SUMIF('00 Alimenta'!$A:$A,$B92,'00 Alimenta'!E:E),SUMIF('00 Alimenta'!$A:$A,$B92,'00 Alimenta'!E:E)*-1)","v":0}]
["BC","BA0090","da pubblico (Aziende sanitarie pubbliche extra Regione) - Mobilità extraregionale","C",{"$f":"IF('00 Aggregatore'!$D93=\"R\",SUMIF('00 Alimenta'!$A:$A,$B93,'00 Alimenta'!D:D),SUMIF('00 Alimenta'!$A:$A,$B93,'00 Alimenta'!D:D)*-1)","v":133040.57},{"$f":"IF('00 Aggregatore'!$D93=\"R\",SUMIF('00 Alimenta'!$A:$A,$B93,'00 Alimenta'!E:E),SUMIF('00 Alimenta'!$A:$A,$B93,'00 Alimenta'!E:E)*-1)","v":187348.99}]
["BC","BA0100","da altri soggetti","C",{"$f":"IF('00 Aggregatore'!$D94=\"R\",SUMIF('00 Alimenta'!$A:$A,$B94,'00 Alimenta'!D:D),SUMIF('00 Alimenta'!$A:$A,$B94,'00 Alimenta'!D:D)*-1)","v":0},{"$f":"IF('00 Aggregatore'!$D94=\"R\",SUMIF('00 Alimenta'!$A:$A,$B94,'00 Alimenta'!E:E),SUMIF('00 Alimenta'!$A:$A,$B94,'00 Alimenta'!E:E)*-1)","v":0}]
["BC","BA0220","Dispositivi medici","C",{"$f":"IF('00 Aggregatore'!$D95=\"R\",SUMIF('00 Alimenta'!$A:$A,$B95,'00 Alimenta'!D:D),SUMIF('00 Alimenta'!$A:$A,$B95,'00 Alimenta'!D:D)*-1)","v":25227619.200000003},{"$f":"IF('00 Aggregatore'!$D95=\"R\",SUMIF('00 Alimenta'!$A:$A,$B95,'00 Alimenta'!E:E),SUMIF('00 Alimenta'!$A:$A,$B95,'00 Alimenta'!E:E)*-1)","v":25764695.790000003}]
["BC","BA0230","Dispositivi medici impiantabili attivi","C",{"$f":"IF('00 Aggregatore'!$D96=\"R\",SUMIF('00 Alimenta'!$A:$A,$B96,'00 Alimenta'!D:D),SUMIF('00 Alimenta'!$A:$A,$B96,'00 Alimenta'!D:D)*-1)","v":3795874.49},{"$f":"IF('00 Aggregatore'!$D96=\"R\",SUMIF('00 Alimenta'!$A:$A,$B96,'00 Alimenta'!E:E),SUMIF('00 Alimenta'!$A:$A,$B96,'00 Alimenta'!E:E)*-1)","v":3456008.28}]
["BC","BA0240","Dispositivi medico diagnostici in vitro (IVD)","C",{"$f":"IF('00 Aggregatore'!$D97=\"R\",SUMIF('00 Alimenta'!$A:$A,$B97,'00 Alimenta'!D:D),SUMIF('00 Alimenta'!$A:$A,$B97,'00 Alimenta'!D:D)*-1)","v":11448832.449999999},{"$f":"IF('00 Aggregatore'!$D97=\"R\",SUMIF('00 Alimenta'!$A:$A,$B97,'00 Alimenta'!E:E),SUMIF('00 Alimenta'!$A:$A,$B97,'00 Alimenta'!E:E)*-1)","v":11969007.5}]
["BC","BA0250","Prodotti dietetici","C",{"$f":"IF('00 Aggregatore'!$D98=\"R\",SUMIF('00 Alimenta'!$A:$A,$B98,'00 Alimenta'!D:D),SUMIF('00 Alimenta'!$A:$A,$B98,'00 Alimenta'!D:D)*-1)","v":440667.16000000003},{"$f":"IF('00 Aggregatore'!$D98=\"R\",SUMIF('00 Alimenta'!$A:$A,$B98,'00 Alimenta'!E:E),SUMIF('00 Alimenta'!$A:$A,$B98,'00 Alimenta'!E:E)*-1)","v":469645.74000000005}]
["BC","BA0260","Materiali per la profilassi (vaccini)","C",{"$f":"IF('00 Aggregatore'!$D99=\"R\",SUMIF('00 Alimenta'!$A:$A,$B99,'00 Alimenta'!D:D),SUMIF('00 Alimenta'!$A:$A,$B99,'00 Alimenta'!D:D)*-1)","v":1380588.41},{"$f":"IF('00 Aggregatore'!$D99=\"R\",SUMIF('00 Alimenta'!$A:$A,$B99,'00 Alimenta'!E:E),SUMIF('00 Alimenta'!$A:$A,$B99,'00 Alimenta'!E:E)*-1)","v":2380862.56}]
["BC","BA0270","Prodotti chimici","C",{"$f":"IF('00 Aggregatore'!$D100=\"R\",SUMIF('00 Alimenta'!$A:$A,$B100,'00 Alimenta'!D:D),SUMIF('00 Alimenta'!$A:$A,$B100,'00 Alimenta'!D:D)*-1)","v":0},{"$f":"IF('00 Aggregatore'!$D100=\"R\",SUMIF('00 Alimenta'!$A:$A,$B100,'00 Alimenta'!E:E),SUMIF('00 Alimenta'!$A:$A,$B100,'00 Alimenta'!E:E)*-1)","v":0}]
["BC","BA0280","Materiali e prodotti per uso veterinario","C",{"$f":"IF('00 Aggregatore'!$D101=\"R\",SUMIF('00 Alimenta'!$A:$A,$B101,'00 Alimenta'!D:D),SUMIF('00 Alimenta'!$A:$A,$B101,'00 Alimenta'!D:D)*-1)","v":33301.29},{"$f":"IF('00 Aggregatore'!$D101=\"R\",SUMIF('00 Alimenta'!$A:$A,$B101,'00 Alimenta'!E:E),SUMIF('00 Alimenta'!$A:$A,$B101,'00 Alimenta'!E:E)*-1)","v":7852.7999999999993}]
["BC","BA0290","Altri beni e prodotti sanitari","C",{"$f":"IF('00 Aggregatore'!$D102=\"R\",SUMIF('00 Alimenta'!$A:$A,$B102,'00 Alimenta'!D:D),SUMIF('00 Alimenta'!$A:$A,$B102,'00 Alimenta'!D:D)*-1)","v":1513330.23},{"$f":"IF('00 Aggregatore'!$D102=\"R\",SUMIF('00 Alimenta'!$A:$A,$B102,'00 Alimenta'!E:E),SUMIF('00 Alimenta'!$A:$A,$B102,'00 Alimenta'!E:E)*-1)","v":1934574.6}]
["BC","BA0300","Beni e prodotti sanitari da Aziende sanitarie pubbliche della Regione","C",{"$f":"IF('00 Aggregatore'!$D103=\"R\",SUMIF('00 Alimenta'!$A:$A,$B103,'00 Alimenta'!D:D),SUMIF('00 Alimenta'!$A:$A,$B103,'00 Alimenta'!D:D)*-1)","v":0},{"$f":"IF('00 Aggregatore'!$D103=\"R\",SUMIF('00 Alimenta'!$A:$A,$B103,'00 Alimenta'!E:E),SUMIF('00 Alimenta'!$A:$A,$B103,'00 Alimenta'!E:E)*-1)","v":0}]
["BC","BA0320","Prodotti alimentari","C",{"$f":"IF('00 Aggregatore'!$D104=\"R\",SUMIF('00 Alimenta'!$A:$A,$B104,'00 Alimenta'!D:D),SUMIF('00 Alimenta'!$A:$A,$B104,'00 Alimenta'!D:D)*-1)","v":259.32},{"$f":"IF('00 Aggregatore'!$D104=\"R\",SUMIF('00 Alimenta'!$A:$A,$B104,'00 Alimenta'!E:E),SUMIF('00 Alimenta'!$A:$A,$B104,'00 Alimenta'!E:E)*-1)","v":250.58}]
["BC","BA0330","Materiali di guardaroba, di pulizia e di convivenza in genere","C",{"$f":"IF('00 Aggregatore'!$D105=\"R\",SUMIF('00 Alimenta'!$A:$A,$B105,'00 Alimenta'!D:D),SUMIF('00 Alimenta'!$A:$A,$B105,'00 Alimenta'!D:D)*-1)","v":29848.15},{"$f":"IF('00 Aggregatore'!$D105=\"R\",SUMIF('00 Alimenta'!$A:$A,$B105,'00 Alimenta'!E:E),SUMIF('00 Alimenta'!$A:$A,$B105,'00 Alimenta'!E:E)*-1)","v":41796.379999999997}]
["BC","BA0340","Combustibili, carburanti e lubrificanti","C",{"$f":"IF('00 Aggregatore'!$D106=\"R\",SUMIF('00 Alimenta'!$A:$A,$B106,'00 Alimenta'!D:D),SUMIF('00 Alimenta'!$A:$A,$B106,'00 Alimenta'!D:D)*-1)","v":125554.88},{"$f":"IF('00 Aggregatore'!$D106=\"R\",SUMIF('00 Alimenta'!$A:$A,$B106,'00 Alimenta'!E:E),SUMIF('00 Alimenta'!$A:$A,$B106,'00 Alimenta'!E:E)*-1)","v":135937.70000000001}]
["BC","BA0350","Supporti informatici e cancelleria","C",{"$f":"IF('00 Aggregatore'!$D107=\"R\",SUMIF('00 Alimenta'!$A:$A,$B107,'00 Alimenta'!D:D),SUMIF('00 Alimenta'!$A:$A,$B107,'00 Alimenta'!D:D)*-1)","v":597417.69000000006},{"$f":"IF('00 Aggregatore'!$D107=\"R\",SUMIF('00 Alimenta'!$A:$A,$B107,'00 Alimenta'!E:E),SUMIF('00 Alimenta'!$A:$A,$B107,'00 Alimenta'!E:E)*-1)","v":513727.87}]
["BC","BA0360","Materiale per la manutenzione","C",{"$f":"IF('00 Aggregatore'!$D108=\"R\",SUMIF('00 Alimenta'!$A:$A,$B108,'00 Alimenta'!D:D),SUMIF('00 Alimenta'!$A:$A,$B108,'00 Alimenta'!D:D)*-1)","v":252738.81},{"$f":"IF('00 Aggregatore'!$D108=\"R\",SUMIF('00 Alimenta'!$A:$A,$B108,'00 Alimenta'!E:E),SUMIF('00 Alimenta'!$A:$A,$B108,'00 Alimenta'!E:E)*-1)","v":207783.52999999997}]
["BC","BA0370","Altri beni e prodotti non sanitari","C",{"$f":"IF('00 Aggregatore'!$D109=\"R\",SUMIF('00 Alimenta'!$A:$A,$B109,'00 Alimenta'!D:D),SUMIF('00 Alimenta'!$A:$A,$B109,'00 Alimenta'!D:D)*-1)","v":49743.28},{"$f":"IF('00 Aggregatore'!$D109=\"R\",SUMIF('00 Alimenta'!$A:$A,$B109,'00 Alimenta'!E:E),SUMIF('00 Alimenta'!$A:$A,$B109,'00 Alimenta'!E:E)*-1)","v":48626.559999999998}]
["BC","BA0380","Beni e prodotti non sanitari da Aziende sanitarie pubbliche della Regione","C",{"$f":"IF('00 Aggregatore'!$D110=\"R\",SUMIF('00 Alimenta'!$A:$A,$B110,'00 Alimenta'!D:D),SUMIF('00 Alimenta'!$A:$A,$B110,'00 Alimenta'!D:D)*-1)","v":0},{"$f":"IF('00 Aggregatore'!$D110=\"R\",SUMIF('00 Alimenta'!$A:$A,$B110,'00 Alimenta'!E:E),SUMIF('00 Alimenta'!$A:$A,$B110,'00 Alimenta'!E:E)*-1)","v":0}]
["BC","BA0430","Costi per assistenza MMG","C",{"$f":"IF('00 Aggregatore'!$D111=\"R\",SUMIF('00 Alimenta'!$A:$A,$B111,'00 Alimenta'!D:D),SUMIF('00 Alimenta'!$A:$A,$B111,'00 Alimenta'!D:D)*-1)","v":24527412.66},{"$f":"IF('00 Aggregatore'!$D111=\"R\",SUMIF('00 Alimenta'!$A:$A,$B111,'00 Alimenta'!E:E),SUMIF('00 Alimenta'!$A:$A,$B111,'00 Alimenta'!E:E)*-1)","v":24328709.329999998}]
["BC","BA0440","Costi per assistenza PLS","C",{"$f":"IF('00 Aggregatore'!$D112=\"R\",SUMIF('00 Alimenta'!$A:$A,$B112,'00 Alimenta'!D:D),SUMIF('00 Alimenta'!$A:$A,$B112,'00 Alimenta'!D:D)*-1)","v":6297522.9199999999},{"$f":"IF('00 Aggregatore'!$D112=\"R\",SUMIF('00 Alimenta'!$A:$A,$B112,'00 Alimenta'!E:E),SUMIF('00 Alimenta'!$A:$A,$B112,'00 Alimenta'!E:E)*-1)","v":6208374.4000000004}]
["BC","BA0450","Costi per assistenza Continuità assistenziale","C",{"$f":"IF('00 Aggregatore'!$D113=\"R\",SUMIF('00 Alimenta'!$A:$A,$B113,'00 Alimenta'!D:D),SUMIF('00 Alimenta'!$A:$A,$B113,'00 Alimenta'!D:D)*-1)","v":4154724.75},{"$f":"IF('00 Aggregatore'!$D113=\"R\",SUMIF('00 Alimenta'!$A:$A,$B113,'00 Alimenta'!E:E),SUMIF('00 Alimenta'!$A:$A,$B113,'00 Alimenta'!E:E)*-1)","v":4008916.53}]
["BC","BA0460","Altro (medicina dei servizi, psicologi, medici 118, ecc.)","C",{"$f":"IF('00 Aggregatore'!$D114=\"R\",SUMIF('00 Alimenta'!$A:$A,$B114,'00 Alimenta'!D:D),SUMIF('00 Alimenta'!$A:$A,$B114,'00 Alimenta'!D:D)*-1)","v":910105.55999999994},{"$f":"IF('00 Aggregatore'!$D114=\"R\",SUMIF('00 Alimenta'!$A:$A,$B114,'00 Alimenta'!E:E),SUMIF('00 Alimenta'!$A:$A,$B114,'00 Alimenta'!E:E)*-1)","v":889849.09}]
["BC","BA0470","da pubblico (Aziende sanitarie pubbliche della Regione) - Mobilità intraregionale","C",{"$f":"IF('00 Aggregatore'!$D115=\"R\",SUMIF('00 Alimenta'!$A:$A,$B115,'00 Alimenta'!D:D),SUMIF('00 Alimenta'!$A:$A,$B115,'00 Alimenta'!D:D)*-1)","v":83439.399999999994},{"$f":"IF('00 Aggregatore'!$D115=\"R\",SUMIF('00 Alimenta'!$A:$A,$B115,'00 Alimenta'!E:E),SUMIF('00 Alimenta'!$A:$A,$B115,'00 Alimenta'!E:E)*-1)","v":35057.19}]
["BC","BA0480","da pubblico (Aziende sanitarie pubbliche extra Regione) - Mobilità extraregionale","C",{"$f":"IF('00 Aggregatore'!$D116=\"R\",SUMIF('00 Alimenta'!$A:$A,$B116,'00 Alimenta'!D:D),SUMIF('00 Alimenta'!$A:$A,$B116,'00 Alimenta'!D:D)*-1)","v":173343.96},{"$f":"IF('00 Aggregatore'!$D116=\"R\",SUMIF('00 Alimenta'!$A:$A,$B116,'00 Alimenta'!E:E),SUMIF('00 Alimenta'!$A:$A,$B116,'00 Alimenta'!E:E)*-1)","v":184748.58}]
["BC","BA0500","da convenzione","C",{"$f":"IF('00 Aggregatore'!$D117=\"R\",SUMIF('00 Alimenta'!$A:$A,$B117,'00 Alimenta'!D:D),SUMIF('00 Alimenta'!$A:$A,$B117,'00 Alimenta'!D:D)*-1)","v":53014279.899999999},{"$f":"IF('00 Aggregatore'!$D117=\"R\",SUMIF('00 Alimenta'!$A:$A,$B117,'00 Alimenta'!E:E),SUMIF('00 Alimenta'!$A:$A,$B117,'00 Alimenta'!E:E)*-1)","v":52924145.520000003}]
["BC","BA0510","da pubblico (Aziende sanitarie pubbliche della Regione) - Mobilità intraregionale","C",{"$f":"IF('00 Aggregatore'!$D118=\"R\",SUMIF('00 Alimenta'!$A:$A,$B118,'00 Alimenta'!D:D),SUMIF('00 Alimenta'!$A:$A,$B118,'00 Alimenta'!D:D)*-1)","v":1241012.19},{"$f":"IF('00 Aggregatore'!$D118=\"R\",SUMIF('00 Alimenta'!$A:$A,$B118,'00 Alimenta'!E:E),SUMIF('00 Alimenta'!$A:$A,$B118,'00 Alimenta'!E:E)*-1)","v":1251970.51}]
["BC","BA0520","da pubblico (extra Regione)","C",{"$f":"IF('00 Aggregatore'!$D119=\"R\",SUMIF('00 Alimenta'!$A:$A,$B119,'00 Alimenta'!D:D),SUMIF('00 Alimenta'!$A:$A,$B119,'00 Alimenta'!D:D)*-1)","v":381774.76},{"$f":"IF('00 Aggregatore'!$D119=\"R\",SUMIF('00 Alimenta'!$A:$A,$B119,'00 Alimenta'!E:E),SUMIF('00 Alimenta'!$A:$A,$B119,'00 Alimenta'!E:E)*-1)","v":387832.02}]
["BC","BA0540","da pubblico (Aziende sanitarie pubbliche della Regione)","C",{"$f":"IF('00 Aggregatore'!$D120=\"R\",SUMIF('00 Alimenta'!$A:$A,$B120,'00 Alimenta'!D:D),SUMIF('00 Alimenta'!$A:$A,$B120,'00 Alimenta'!D:D)*-1)","v":8524168.6600000001},{"$f":"IF('00 Aggregatore'!$D120=\"R\",SUMIF('00 Alimenta'!$A:$A,$B120,'00 Alimenta'!E:E),SUMIF('00 Alimenta'!$A:$A,$B120,'00 Alimenta'!E:E)*-1)","v":8998122.1099999994}]
["BC","BA0550","da pubblico (altri soggetti pubblici della Regione)","C",{"$f":"IF('00 Aggregatore'!$D121=\"R\",SUMIF('00 Alimenta'!$A:$A,$B121,'00 Alimenta'!D:D),SUMIF('00 Alimenta'!$A:$A,$B121,'00 Alimenta'!D:D)*-1)","v":224364.91},{"$f":"IF('00 Aggregatore'!$D121=\"R\",SUMIF('00 Alimenta'!$A:$A,$B121,'00 Alimenta'!E:E),SUMIF('00 Alimenta'!$A:$A,$B121,'00 Alimenta'!E:E)*-1)","v":189344.67}]
["BC","BA0560","da pubblico (extra Regione)","C",{"$f":"IF('00 Aggregatore'!$D122=\"R\",SUMIF('00 Alimenta'!$A:$A,$B122,'00 Alimenta'!D:D),SUMIF('00 Alimenta'!$A:$A,$B122,'00 Alimenta'!D:D)*-1)","v":3048586.34},{"$f":"IF('00 Aggregatore'!$D122=\"R\",SUMIF('00 Alimenta'!$A:$A,$B122,'00 Alimenta'!E:E),SUMIF('00 Alimenta'!$A:$A,$B122,'00 Alimenta'!E:E)*-1)","v":4460024.9400000004}]
["BC","BA0570","da privato - Medici SUMAI","C",{"$f":"IF('00 Aggregatore'!$D123=\"R\",SUMIF('00 Alimenta'!$A:$A,$B123,'00 Alimenta'!D:D),SUMIF('00 Alimenta'!$A:$A,$B123,'00 Alimenta'!D:D)*-1)","v":5114503.17},{"$f":"IF('00 Aggregatore'!$D123=\"R\",SUMIF('00 Alimenta'!$A:$A,$B123,'00 Alimenta'!E:E),SUMIF('00 Alimenta'!$A:$A,$B123,'00 Alimenta'!E:E)*-1)","v":4899151.05}]
["BC","BA0590","Servizi sanitari per assistenza specialistica da IRCCS privati e Policlinici privati","C",{"$f":"IF('00 Aggregatore'!$D124=\"R\",SUMIF('00 Alimenta'!$A:$A,$B124,'00 Alimenta'!D:D),SUMIF('00 Alimenta'!$A:$A,$B124,'00 Alimenta'!D:D)*-1)","v":44362.83},{"$f":"IF('00 Aggregatore'!$D124=\"R\",SUMIF('00 Alimenta'!$A:$A,$B124,'00 Alimenta'!E:E),SUMIF('00 Alimenta'!$A:$A,$B124,'00 Alimenta'!E:E)*-1)","v":60978.73}]
["BC","BA0600","Servizi sanitari per assistenza specialistica da Ospedali Classificati privati","C",{"$f":"IF('00 Aggregatore'!$D125=\"R\",SUMIF('00 Alimenta'!$A:$A,$B125,'00 Alimenta'!D:D),SUMIF('00 Alimenta'!$A:$A,$B125,'00 Alimenta'!D:D)*-1)","v":0},{"$f":"IF('00 Aggregatore'!$D125=\"R\",SUMIF('00 Alimenta'!$A:$A,$B125,'00 Alimenta'!E:E),SUMIF('00 Alimenta'!$A:$A,$B125,'00 Alimenta'!E:E)*-1)","v":0}]
["BC","BA0610","Servizi sanitari per assistenza specialistica da Case di Cura private","C",{"$f":"IF('00 Aggregatore'!$D126=\"R\",SUMIF('00 Alimenta'!$A:$A,$B126,'00 Alimenta'!D:D),SUMIF('00 Alimenta'!$A:$A,$B126,'00 Alimenta'!D:D)*-1)","v":5364433.0199999996},{"$f":"IF('00 Aggregatore'!$D126=\"R\",SUMIF('00 Alimenta'!$A:$A,$B126,'00 Alimenta'!E:E),SUMIF('00 Alimenta'!$A:$A,$B126,'00 Alimenta'!E:E)*-1)","v":5412858.8699999992}]
["BC","BA0620","Servizi sanitari per assistenza specialistica da altri privati","C",{"$f":"IF('00 Aggregatore'!$D127=\"R\",SUMIF('00 Alimenta'!$A:$A,$B127,'00 Alimenta'!D:D),SUMIF('00 Alimenta'!$A:$A,$B127,'00 Alimenta'!D:D)*-1)","v":3188051.21},{"$f":"IF('00 Aggregatore'!$D127=\"R\",SUMIF('00 Alimenta'!$A:$A,$B127,'00 Alimenta'!E:E),SUMIF('00 Alimenta'!$A:$A,$B127,'00 Alimenta'!E:E)*-1)","v":3284005.5}]
["BC","BA0630","da privato per cittadini non residenti - extra Regione (Mobilità attiva in compensazione)","C",{"$f":"IF('00 Aggregatore'!$D128=\"R\",SUMIF('00 Alimenta'!$A:$A,$B128,'00 Alimenta'!D:D),SUMIF('00 Alimenta'!$A:$A,$B128,'00 Alimenta'!D:D)*-1)","v":196243.84999999998},{"$f":"IF('00 Aggregatore'!$D128=\"R\",SUMIF('00 Alimenta'!$A:$A,$B128,'00 Alimenta'!E:E),SUMIF('00 Alimenta'!$A:$A,$B128,'00 Alimenta'!E:E)*-1)","v":214698.2}]
["BC","BA0650","da pubblico (Aziende sanitarie pubbliche della Regione)","C",{"$f":"IF('00 Aggregatore'!$D129=\"R\",SUMIF('00 Alimenta'!$A:$A,$B129,'00 Alimenta'!D:D),SUMIF('00 Alimenta'!$A:$A,$B129,'00 Alimenta'!D:D)*-1)","v":4525129.8},{"$f":"IF('00 Aggregatore'!$D129=\"R\",SUMIF('00 Alimenta'!$A:$A,$B129,'00 Alimenta'!E:E),SUMIF('00 Alimenta'!$A:$A,$B129,'00 Alimenta'!E:E)*-1)","v":4855060.17}]
["BC","BA0660","da pubblico (altri soggetti pubblici della Regione)","C",{"$f":"IF('00 Aggregatore'!$D130=\"R\",SUMIF('00 Alimenta'!$A:$A,$B130,'00 Alimenta'!D:D),SUMIF('00 Alimenta'!$A:$A,$B130,'00 Alimenta'!D:D)*-1)","v":0},{"$f":"IF('00 Aggregatore'!$D130=\"R\",SUMIF('00 Alimenta'!$A:$A,$B130,'00 Alimenta'!E:E),SUMIF('00 Alimenta'!$A:$A,$B130,'00 Alimenta'!E:E)*-1)","v":0}]
["BC","BA0670","da pubblico (extra Regione) non soggetti a compensazione","C",{"$f":"IF('00 Aggregatore'!$D131=\"R\",SUMIF('00 Alimenta'!$A:$A,$B131,'00 Alimenta'!D:D),SUMIF('00 Alimenta'!$A:$A,$B131,'00 Alimenta'!D:D)*-1)","v":0},{"$f":"IF('00 Aggregatore'!$D131=\"R\",SUMIF('00 Alimenta'!$A:$A,$B131,'00 Alimenta'!E:E),SUMIF('00 Alimenta'!$A:$A,$B131,'00 Alimenta'!E:E)*-1)","v":0}]
["BC","BA0680","da privato (intraregionale)","C",{"$f":"IF('00 Aggregatore'!$D132=\"R\",SUMIF('00 Alimenta'!$A:$A,$B132,'00 Alimenta'!D:D),SUMIF('00 Alimenta'!$A:$A,$B132,'00 Alimenta'!D:D)*-1)","v":14443763.359999999},{"$f":"IF('00 Aggregatore'!$D132=\"R\",SUMIF('00 Alimenta'!$A:$A,$B132,'00 Alimenta'!E:E),SUMIF('00 Alimenta'!$A:$A,$B132,'00 Alimenta'!E:E)*-1)","v":14460769.459999999}]
["BC","BA0690","da privato (extraregionale)","C",{"$f":"IF('00 Aggregatore'!$D133=\"R\",SUMIF('00 Alimenta'!$A:$A,$B133,'00 Alimenta'!D:D),SUMIF('00 Alimenta'!$A:$A,$B133,'00 Alimenta'!D:D)*-1)","v":792965.98},{"$f":"IF('00 Aggregatore'!$D133=\"R\",SUMIF('00 Alimenta'!$A:$A,$B133,'00 Alimenta'!E:E),SUMIF('00 Alimenta'!$A:$A,$B133,'00 Alimenta'!E:E)*-1)","v":591378.35}]
[{"$f":"LEFT(B134,1)&D134","v":"BC"},"BA0710","da pubblico (Aziende sanitarie pubbliche della Regione)","C",{"$f":"IF('00 Aggregatore'!$D134=\"R\",SUMIF('00 Alimenta'!$A:$A,$B134,'00 Alimenta'!D:D),SUMIF('00 Alimenta'!$A:$A,$B134,'00 Alimenta'!D:D)*-1)","v":0},{"$f":"IF('00 Aggregatore'!$D134=\"R\",SUMIF('00 Alimenta'!$A:$A,$B134,'00 Alimenta'!E:E),SUMIF('00 Alimenta'!$A:$A,$B134,'00 Alimenta'!E:E)*-1)","v":0}]
["BC","BA0720","da pubblico (altri soggetti pubblici della Regione)","C",{"$f":"IF('00 Aggregatore'!$D135=\"R\",SUMIF('00 Alimenta'!$A:$A,$B135,'00 Alimenta'!D:D),SUMIF('00 Alimenta'!$A:$A,$B135,'00 Alimenta'!D:D)*-1)","v":0},{"$f":"IF('00 Aggregatore'!$D135=\"R\",SUMIF('00 Alimenta'!$A:$A,$B135,'00 Alimenta'!E:E),SUMIF('00 Alimenta'!$A:$A,$B135,'00 Alimenta'!E:E)*-1)","v":0}]
["BC","BA0730","da pubblico (extra Regione)","C",{"$f":"IF('00 Aggregatore'!$D136=\"R\",SUMIF('00 Alimenta'!$A:$A,$B136,'00 Alimenta'!D:D),SUMIF('00 Alimenta'!$A:$A,$B136,'00 Alimenta'!D:D)*-1)","v":0},{"$f":"IF('00 Aggregatore'!$D136=\"R\",SUMIF('00 Alimenta'!$A:$A,$B136,'00 Alimenta'!E:E),SUMIF('00 Alimenta'!$A:$A,$B136,'00 Alimenta'!E:E)*-1)","v":0}]
["BC","BA0740","da privato","C",{"$f":"IF('00 Aggregatore'!$D137=\"R\",SUMIF('00 Alimenta'!$A:$A,$B137,'00 Alimenta'!D:D),SUMIF('00 Alimenta'!$A:$A,$B137,'00 Alimenta'!D:D)*-1)","v":1692964.4},{"$f":"IF('00 Aggregatore'!$D137=\"R\",SUMIF('00 Alimenta'!$A:$A,$B137,'00 Alimenta'!E:E),SUMIF('00 Alimenta'!$A:$A,$B137,'00 Alimenta'!E:E)*-1)","v":1813040.82}]
["BC","BA0760","da pubblico (Aziende sanitarie pubbliche della Regione)","C",{"$f":"IF('00 Aggregatore'!$D138=\"R\",SUMIF('00 Alimenta'!$A:$A,$B138,'00 Alimenta'!D:D),SUMIF('00 Alimenta'!$A:$A,$B138,'00 Alimenta'!D:D)*-1)","v":0},{"$f":"IF('00 Aggregatore'!$D138=\"R\",SUMIF('00 Alimenta'!$A:$A,$B138,'00 Alimenta'!E:E),SUMIF('00 Alimenta'!$A:$A,$B138,'00 Alimenta'!E:E)*-1)","v":0}]
["BC","BA0770","da pubblico (altri soggetti pubblici della Regione)","C",{"$f":"IF('00 Aggregatore'!$D139=\"R\",SUMIF('00 Alimenta'!$A:$A,$B139,'00 Alimenta'!D:D),SUMIF('00 Alimenta'!$A:$A,$B139,'00 Alimenta'!D:D)*-1)","v":0},{"$f":"IF('00 Aggregatore'!$D139=\"R\",SUMIF('00 Alimenta'!$A:$A,$B139,'00 Alimenta'!E:E),SUMIF('00 Alimenta'!$A:$A,$B139,'00 Alimenta'!E:E)*-1)","v":0}]
["BC","BA0780","da pubblico (extra Regione)","C",{"$f":"IF('00 Aggregatore'!$D140=\"R\",SUMIF('00 Alimenta'!$A:$A,$B140,'00 Alimenta'!D:D),SUMIF('00 Alimenta'!$A:$A,$B140,'00 Alimenta'!D:D)*-1)","v":0},{"$f":"IF('00 Aggregatore'!$D140=\"R\",SUMIF('00 Alimenta'!$A:$A,$B140,'00 Alimenta'!E:E),SUMIF('00 Alimenta'!$A:$A,$B140,'00 Alimenta'!E:E)*-1)","v":0}]
["BC","BA0790","da privato","C",{"$f":"IF('00 Aggregatore'!$D141=\"R\",SUMIF('00 Alimenta'!$A:$A,$B141,'00 Alimenta'!D:D),SUMIF('00 Alimenta'!$A:$A,$B141,'00 Alimenta'!D:D)*-1)","v":6610863.3500000006},{"$f":"IF('00 Aggregatore'!$D141=\"R\",SUMIF('00 Alimenta'!$A:$A,$B141,'00 Alimenta'!E:E),SUMIF('00 Alimenta'!$A:$A,$B141,'00 Alimenta'!E:E)*-1)","v":6384295.54}]
["BC","BA0810","da pubblico (Aziende sanitarie pubbliche della Regione)","C",{"$f":"IF('00 Aggregatore'!$D142=\"R\",SUMIF('00 Alimenta'!$A:$A,$B142,'00 Alimenta'!D:D),SUMIF('00 Alimenta'!$A:$A,$B142,'00 Alimenta'!D:D)*-1)","v":28209224.370000001},{"$f":"IF('00 Aggregatore'!$D142=\"R\",SUMIF('00 Alimenta'!$A:$A,$B142,'00 Alimenta'!E:E),SUMIF('00 Alimenta'!$A:$A,$B142,'00 Alimenta'!E:E)*-1)","v":28230091.68}]
["BC","BA0820","da pubblico (altri soggetti pubblici della Regione)","C",{"$f":"IF('00 Aggregatore'!$D143=\"R\",SUMIF('00 Alimenta'!$A:$A,$B143,'00 Alimenta'!D:D),SUMIF('00 Alimenta'!$A:$A,$B143,'00 Alimenta'!D:D)*-1)","v":0},{"$f":"IF('00 Aggregatore'!$D143=\"R\",SUMIF('00 Alimenta'!$A:$A,$B143,'00 Alimenta'!E:E),SUMIF('00 Alimenta'!$A:$A,$B143,'00 Alimenta'!E:E)*-1)","v":0}]
["BC","BA0830","da pubblico (extra Regione)","C",{"$f":"IF('00 Aggregatore'!$D144=\"R\",SUMIF('00 Alimenta'!$A:$A,$B144,'00 Alimenta'!D:D),SUMIF('00 Alimenta'!$A:$A,$B144,'00 Alimenta'!D:D)*-1)","v":23636269.289999999},{"$f":"IF('00 Aggregatore'!$D144=\"R\",SUMIF('00 Alimenta'!$A:$A,$B144,'00 Alimenta'!E:E),SUMIF('00 Alimenta'!$A:$A,$B144,'00 Alimenta'!E:E)*-1)","v":23048879.050000001}]
["BC","BA0850","Servizi sanitari per assistenza ospedaliera da IRCCS privati e Policlinici privati","C",{"$f":"IF('00 Aggregatore'!$D145=\"R\",SUMIF('00 Alimenta'!$A:$A,$B145,'00 Alimenta'!D:D),SUMIF('00 Alimenta'!$A:$A,$B145,'00 Alimenta'!D:D)*-1)","v":0},{"$f":"IF('00 Aggregatore'!$D145=\"R\",SUMIF('00 Alimenta'!$A:$A,$B145,'00 Alimenta'!E:E),SUMIF('00 Alimenta'!$A:$A,$B145,'00 Alimenta'!E:E)*-1)","v":0}]
["BC","BA0860","Servizi sanitari per assistenza ospedaliera da Ospedali Classificati privati","C",{"$f":"IF('00 Aggregatore'!$D146=\"R\",SUMIF('00 Alimenta'!$A:$A,$B146,'00 Alimenta'!D:D),SUMIF('00 Alimenta'!$A:$A,$B146,'00 Alimenta'!D:D)*-1)","v":0},{"$f":"IF('00 Aggregatore'!$D146=\"R\",SUMIF('00 Alimenta'!$A:$A,$B146,'00 Alimenta'!E:E),SUMIF('00 Alimenta'!$A:$A,$B146,'00 Alimenta'!E:E)*-1)","v":0}]
["BC","BA0870","Servizi sanitari per assistenza ospedaliera da Case di Cura private","C",{"$f":"IF('00 Aggregatore'!$D147=\"R\",SUMIF('00 Alimenta'!$A:$A,$B147,'00 Alimenta'!D:D),SUMIF('00 Alimenta'!$A:$A,$B147,'00 Alimenta'!D:D)*-1)","v":61570511.920000002},{"$f":"IF('00 Aggregatore'!$D147=\"R\",SUMIF('00 Alimenta'!$A:$A,$B147,'00 Alimenta'!E:E),SUMIF('00 Alimenta'!$A:$A,$B147,'00 Alimenta'!E:E)*-1)","v":61809764.719999999}]
["BC","BA0880","Servizi sanitari per assistenza ospedaliera da altri privati","C",{"$f":"IF('00 Aggregatore'!$D148=\"R\",SUMIF('00 Alimenta'!$A:$A,$B148,'00 Alimenta'!D:D),SUMIF('00 Alimenta'!$A:$A,$B148,'00 Alimenta'!D:D)*-1)","v":0},{"$f":"IF('00 Aggregatore'!$D148=\"R\",SUMIF('00 Alimenta'!$A:$A,$B148,'00 Alimenta'!E:E),SUMIF('00 Alimenta'!$A:$A,$B148,'00 Alimenta'!E:E)*-1)","v":0}]
["BC","BA0890","da privato per cittadini non residenti - extra Regione (mobilità attiva in compensazione)","C",{"$f":"IF('00 Aggregatore'!$D149=\"R\",SUMIF('00 Alimenta'!$A:$A,$B149,'00 Alimenta'!D:D),SUMIF('00 Alimenta'!$A:$A,$B149,'00 Alimenta'!D:D)*-1)","v":11496977.640000001},{"$f":"IF('00 Aggregatore'!$D149=\"R\",SUMIF('00 Alimenta'!$A:$A,$B149,'00 Alimenta'!E:E),SUMIF('00 Alimenta'!$A:$A,$B149,'00 Alimenta'!E:E)*-1)","v":11917704.07}]
["BC","BA0910","da pubblico (Aziende sanitarie pubbliche della Regione)","C",{"$f":"IF('00 Aggregatore'!$D150=\"R\",SUMIF('00 Alimenta'!$A:$A,$B150,'00 Alimenta'!D:D),SUMIF('00 Alimenta'!$A:$A,$B150,'00 Alimenta'!D:D)*-1)","v":1713800.54},{"$f":"IF('00 Aggregatore'!$D150=\"R\",SUMIF('00 Alimenta'!$A:$A,$B150,'00 Alimenta'!E:E),SUMIF('00 Alimenta'!$A:$A,$B150,'00 Alimenta'!E:E)*-1)","v":1648164.66}]
["BC","BA0920","da pubblico (altri soggetti pubblici della Regione)","C",{"$f":"IF('00 Aggregatore'!$D151=\"R\",SUMIF('00 Alimenta'!$A:$A,$B151,'00 Alimenta'!D:D),SUMIF('00 Alimenta'!$A:$A,$B151,'00 Alimenta'!D:D)*-1)","v":0},{"$f":"IF('00 Aggregatore'!$D151=\"R\",SUMIF('00 Alimenta'!$A:$A,$B151,'00 Alimenta'!E:E),SUMIF('00 Alimenta'!$A:$A,$B151,'00 Alimenta'!E:E)*-1)","v":0}]
["BC","BA0930","da pubblico (extra Regione) - Non soggette a compensazione","C",{"$f":"IF('00 Aggregatore'!$D152=\"R\",SUMIF('00 Alimenta'!$A:$A,$B152,'00 Alimenta'!D:D),SUMIF('00 Alimenta'!$A:$A,$B152,'00 Alimenta'!D:D)*-1)","v":32900.5},{"$f":"IF('00 Aggregatore'!$D152=\"R\",SUMIF('00 Alimenta'!$A:$A,$B152,'00 Alimenta'!E:E),SUMIF('00 Alimenta'!$A:$A,$B152,'00 Alimenta'!E:E)*-1)","v":6667}]
["BC","BA0940","da privato (intraregionale)","C",{"$f":"IF('00 Aggregatore'!$D153=\"R\",SUMIF('00 Alimenta'!$A:$A,$B153,'00 Alimenta'!D:D),SUMIF('00 Alimenta'!$A:$A,$B153,'00 Alimenta'!D:D)*-1)","v":9642524.2799999993},{"$f":"IF('00 Aggregatore'!$D153=\"R\",SUMIF('00 Alimenta'!$A:$A,$B153,'00 Alimenta'!E:E),SUMIF('00 Alimenta'!$A:$A,$B153,'00 Alimenta'!E:E)*-1)","v":9671880.5899999999}]
["BC","BA0950","da privato (extraregionale)","C",{"$f":"IF('00 Aggregatore'!$D154=\"R\",SUMIF('00 Alimenta'!$A:$A,$B154,'00 Alimenta'!D:D),SUMIF('00 Alimenta'!$A:$A,$B154,'00 Alimenta'!D:D)*-1)","v":2178595.92},{"$f":"IF('00 Aggregatore'!$D154=\"R\",SUMIF('00 Alimenta'!$A:$A,$B154,'00 Alimenta'!E:E),SUMIF('00 Alimenta'!$A:$A,$B154,'00 Alimenta'!E:E)*-1)","v":1872398.81}]
["BC","BA0970","da pubblico (Aziende sanitarie pubbliche della Regione) - Mobilità intraregionale","C",{"$f":"IF('00 Aggregatore'!$D155=\"R\",SUMIF('00 Alimenta'!$A:$A,$B155,'00 Alimenta'!D:D),SUMIF('00 Alimenta'!$A:$A,$B155,'00 Alimenta'!D:D)*-1)","v":5023688.8099999996},{"$f":"IF('00 Aggregatore'!$D155=\"R\",SUMIF('00 Alimenta'!$A:$A,$B155,'00 Alimenta'!E:E),SUMIF('00 Alimenta'!$A:$A,$B155,'00 Alimenta'!E:E)*-1)","v":4391409.7}]
["BC","BA0980","da pubblico (altri soggetti pubblici della Regione)","C",{"$f":"IF('00 Aggregatore'!$D156=\"R\",SUMIF('00 Alimenta'!$A:$A,$B156,'00 Alimenta'!D:D),SUMIF('00 Alimenta'!$A:$A,$B156,'00 Alimenta'!D:D)*-1)","v":0},{"$f":"IF('00 Aggregatore'!$D156=\"R\",SUMIF('00 Alimenta'!$A:$A,$B156,'00 Alimenta'!E:E),SUMIF('00 Alimenta'!$A:$A,$B156,'00 Alimenta'!E:E)*-1)","v":0}]
["BC","BA0990","da pubblico (extra Regione)","C",{"$f":"IF('00 Aggregatore'!$D157=\"R\",SUMIF('00 Alimenta'!$A:$A,$B157,'00 Alimenta'!D:D),SUMIF('00 Alimenta'!$A:$A,$B157,'00 Alimenta'!D:D)*-1)","v":1172122.05},{"$f":"IF('00 Aggregatore'!$D157=\"R\",SUMIF('00 Alimenta'!$A:$A,$B157,'00 Alimenta'!E:E),SUMIF('00 Alimenta'!$A:$A,$B157,'00 Alimenta'!E:E)*-1)","v":1585422.33}]
["BC","BA1000","da privato (intraregionale)","C",{"$f":"IF('00 Aggregatore'!$D158=\"R\",SUMIF('00 Alimenta'!$A:$A,$B158,'00 Alimenta'!D:D),SUMIF('00 Alimenta'!$A:$A,$B158,'00 Alimenta'!D:D)*-1)","v":0},{"$f":"IF('00 Aggregatore'!$D158=\"R\",SUMIF('00 Alimenta'!$A:$A,$B158,'00 Alimenta'!E:E),SUMIF('00 Alimenta'!$A:$A,$B158,'00 Alimenta'!E:E)*-1)","v":0}]
["BC","BA1010","da privato (extraregionale)","C",{"$f":"IF('00 Aggregatore'!$D159=\"R\",SUMIF('00 Alimenta'!$A:$A,$B159,'00 Alimenta'!D:D),SUMIF('00 Alimenta'!$A:$A,$B159,'00 Alimenta'!D:D)*-1)","v":0},{"$f":"IF('00 Aggregatore'!$D159=\"R\",SUMIF('00 Alimenta'!$A:$A,$B159,'00 Alimenta'!E:E),SUMIF('00 Alimenta'!$A:$A,$B159,'00 Alimenta'!E:E)*-1)","v":0}]
["BC","BA1020","da privato per cittadini non residenti - extra Regione (mobilità attiva in compensazione)","C",{"$f":"IF('00 Aggregatore'!$D160=\"R\",SUMIF('00 Alimenta'!$A:$A,$B160,'00 Alimenta'!D:D),SUMIF('00 Alimenta'!$A:$A,$B160,'00 Alimenta'!D:D)*-1)","v":0},{"$f":"IF('00 Aggregatore'!$D160=\"R\",SUMIF('00 Alimenta'!$A:$A,$B160,'00 Alimenta'!E:E),SUMIF('00 Alimenta'!$A:$A,$B160,'00 Alimenta'!E:E)*-1)","v":0}]
["BC","BA1040","da pubblico (Aziende sanitarie pubbliche della Regione) - Mobilità intraregionale","C",{"$f":"IF('00 Aggregatore'!$D161=\"R\",SUMIF('00 Alimenta'!$A:$A,$B161,'00 Alimenta'!D:D),SUMIF('00 Alimenta'!$A:$A,$B161,'00 Alimenta'!D:D)*-1)","v":46.2},{"$f":"IF('00 Aggregatore'!$D161=\"R\",SUMIF('00 Alimenta'!$A:$A,$B161,'00 Alimenta'!E:E),SUMIF('00 Alimenta'!$A:$A,$B161,'00 Alimenta'!E:E)*-1)","v":0}]
["BC","BA1050","da pubblico (altri soggetti pubblici della Regione)","C",{"$f":"IF('00 Aggregatore'!$D162=\"R\",SUMIF('00 Alimenta'!$A:$A,$B162,'00 Alimenta'!D:D),SUMIF('00 Alimenta'!$A:$A,$B162,'00 Alimenta'!D:D)*-1)","v":0},{"$f":"IF('00 Aggregatore'!$D162=\"R\",SUMIF('00 Alimenta'!$A:$A,$B162,'00 Alimenta'!E:E),SUMIF('00 Alimenta'!$A:$A,$B162,'00 Alimenta'!E:E)*-1)","v":0}]
["BC","BA1060","da pubblico (extra Regione)","C",{"$f":"IF('00 Aggregatore'!$D163=\"R\",SUMIF('00 Alimenta'!$A:$A,$B163,'00 Alimenta'!D:D),SUMIF('00 Alimenta'!$A:$A,$B163,'00 Alimenta'!D:D)*-1)","v":199293.42},{"$f":"IF('00 Aggregatore'!$D163=\"R\",SUMIF('00 Alimenta'!$A:$A,$B163,'00 Alimenta'!E:E),SUMIF('00 Alimenta'!$A:$A,$B163,'00 Alimenta'!E:E)*-1)","v":159884.29}]
["BC","BA1070","da privato","C",{"$f":"IF('00 Aggregatore'!$D164=\"R\",SUMIF('00 Alimenta'!$A:$A,$B164,'00 Alimenta'!D:D),SUMIF('00 Alimenta'!$A:$A,$B164,'00 Alimenta'!D:D)*-1)","v":1994460.87},{"$f":"IF('00 Aggregatore'!$D164=\"R\",SUMIF('00 Alimenta'!$A:$A,$B164,'00 Alimenta'!E:E),SUMIF('00 Alimenta'!$A:$A,$B164,'00 Alimenta'!E:E)*-1)","v":1888589.9699999997}]
["BC","BA1080","da privato per cittadini non residenti - extra Regione (mobilità attiva in compensazione)","C",{"$f":"IF('00 Aggregatore'!$D165=\"R\",SUMIF('00 Alimenta'!$A:$A,$B165,'00 Alimenta'!D:D),SUMIF('00 Alimenta'!$A:$A,$B165,'00 Alimenta'!D:D)*-1)","v":260263.90000000002},{"$f":"IF('00 Aggregatore'!$D165=\"R\",SUMIF('00 Alimenta'!$A:$A,$B165,'00 Alimenta'!E:E),SUMIF('00 Alimenta'!$A:$A,$B165,'00 Alimenta'!E:E)*-1)","v":240189.57}]
["BC","BA1100","da pubblico (Aziende sanitarie pubbliche della Regione) - Mobilità intraregionale","C",{"$f":"IF('00 Aggregatore'!$D166=\"R\",SUMIF('00 Alimenta'!$A:$A,$B166,'00 Alimenta'!D:D),SUMIF('00 Alimenta'!$A:$A,$B166,'00 Alimenta'!D:D)*-1)","v":76616.539999999994},{"$f":"IF('00 Aggregatore'!$D166=\"R\",SUMIF('00 Alimenta'!$A:$A,$B166,'00 Alimenta'!E:E),SUMIF('00 Alimenta'!$A:$A,$B166,'00 Alimenta'!E:E)*-1)","v":124342.79}]
["BC","BA1110","da pubblico (altri soggetti pubblici della Regione)","C",{"$f":"IF('00 Aggregatore'!$D167=\"R\",SUMIF('00 Alimenta'!$A:$A,$B167,'00 Alimenta'!D:D),SUMIF('00 Alimenta'!$A:$A,$B167,'00 Alimenta'!D:D)*-1)","v":0},{"$f":"IF('00 Aggregatore'!$D167=\"R\",SUMIF('00 Alimenta'!$A:$A,$B167,'00 Alimenta'!E:E),SUMIF('00 Alimenta'!$A:$A,$B167,'00 Alimenta'!E:E)*-1)","v":0}]
["BC","BA1120","da pubblico (extra Regione)","C",{"$f":"IF('00 Aggregatore'!$D168=\"R\",SUMIF('00 Alimenta'!$A:$A,$B168,'00 Alimenta'!D:D),SUMIF('00 Alimenta'!$A:$A,$B168,'00 Alimenta'!D:D)*-1)","v":91959.29},{"$f":"IF('00 Aggregatore'!$D168=\"R\",SUMIF('00 Alimenta'!$A:$A,$B168,'00 Alimenta'!E:E),SUMIF('00 Alimenta'!$A:$A,$B168,'00 Alimenta'!E:E)*-1)","v":228483.68}]
["BC","BA1130","da privato","C",{"$f":"IF('00 Aggregatore'!$D169=\"R\",SUMIF('00 Alimenta'!$A:$A,$B169,'00 Alimenta'!D:D),SUMIF('00 Alimenta'!$A:$A,$B169,'00 Alimenta'!D:D)*-1)","v":7262349.3300000001},{"$f":"IF('00 Aggregatore'!$D169=\"R\",SUMIF('00 Alimenta'!$A:$A,$B169,'00 Alimenta'!E:E),SUMIF('00 Alimenta'!$A:$A,$B169,'00 Alimenta'!E:E)*-1)","v":8159911.3799999999}]
["BC","BA1150","da pubblico (Aziende sanitarie pubbliche della Regione) - Mobilità intraregionale","C",{"$f":"IF('00 Aggregatore'!$D170=\"R\",SUMIF('00 Alimenta'!$A:$A,$B170,'00 Alimenta'!D:D),SUMIF('00 Alimenta'!$A:$A,$B170,'00 Alimenta'!D:D)*-1)","v":1929611.4},{"$f":"IF('00 Aggregatore'!$D170=\"R\",SUMIF('00 Alimenta'!$A:$A,$B170,'00 Alimenta'!E:E),SUMIF('00 Alimenta'!$A:$A,$B170,'00 Alimenta'!E:E)*-1)","v":1737461.12}]
["BC","BA1160","da pubblico (altri soggetti pubblici della Regione)","C",{"$f":"IF('00 Aggregatore'!$D171=\"R\",SUMIF('00 Alimenta'!$A:$A,$B171,'00 Alimenta'!D:D),SUMIF('00 Alimenta'!$A:$A,$B171,'00 Alimenta'!D:D)*-1)","v":0},{"$f":"IF('00 Aggregatore'!$D171=\"R\",SUMIF('00 Alimenta'!$A:$A,$B171,'00 Alimenta'!E:E),SUMIF('00 Alimenta'!$A:$A,$B171,'00 Alimenta'!E:E)*-1)","v":0}]
["BC","BA1170","da pubblico (extra Regione) non soggette a compensazione","C",{"$f":"IF('00 Aggregatore'!$D172=\"R\",SUMIF('00 Alimenta'!$A:$A,$B172,'00 Alimenta'!D:D),SUMIF('00 Alimenta'!$A:$A,$B172,'00 Alimenta'!D:D)*-1)","v":334811.51},{"$f":"IF('00 Aggregatore'!$D172=\"R\",SUMIF('00 Alimenta'!$A:$A,$B172,'00 Alimenta'!E:E),SUMIF('00 Alimenta'!$A:$A,$B172,'00 Alimenta'!E:E)*-1)","v":168459.48}]
["BC","BA1180","da privato (intraregionale)","C",{"$f":"IF('00 Aggregatore'!$D173=\"R\",SUMIF('00 Alimenta'!$A:$A,$B173,'00 Alimenta'!D:D),SUMIF('00 Alimenta'!$A:$A,$B173,'00 Alimenta'!D:D)*-1)","v":12820370.060000001},{"$f":"IF('00 Aggregatore'!$D173=\"R\",SUMIF('00 Alimenta'!$A:$A,$B173,'00 Alimenta'!E:E),SUMIF('00 Alimenta'!$A:$A,$B173,'00 Alimenta'!E:E)*-1)","v":12551624.019999998}]
["BC","BA1190","da privato (extraregionale)","C",{"$f":"IF('00 Aggregatore'!$D174=\"R\",SUMIF('00 Alimenta'!$A:$A,$B174,'00 Alimenta'!D:D),SUMIF('00 Alimenta'!$A:$A,$B174,'00 Alimenta'!D:D)*-1)","v":1606830.4500000002},{"$f":"IF('00 Aggregatore'!$D174=\"R\",SUMIF('00 Alimenta'!$A:$A,$B174,'00 Alimenta'!E:E),SUMIF('00 Alimenta'!$A:$A,$B174,'00 Alimenta'!E:E)*-1)","v":1751767.75}]
["BC","BA1210","Compartecipazione al personale per attività libero professionale intramoenia - Area ospedaliera","C",{"$f":"IF('00 Aggregatore'!$D175=\"R\",SUMIF('00 Alimenta'!$A:$A,$B175,'00 Alimenta'!D:D),SUMIF('00 Alimenta'!$A:$A,$B175,'00 Alimenta'!D:D)*-1)","v":65875.14},{"$f":"IF('00 Aggregatore'!$D175=\"R\",SUMIF('00 Alimenta'!$A:$A,$B175,'00 Alimenta'!E:E),SUMIF('00 Alimenta'!$A:$A,$B175,'00 Alimenta'!E:E)*-1)","v":36801.340000000004}]
["BC","BA1220","Compartecipazione al personale per attività libero professionale intramoenia - Area specialistica","C",{"$f":"IF('00 Aggregatore'!$D176=\"R\",SUMIF('00 Alimenta'!$A:$A,$B176,'00 Alimenta'!D:D),SUMIF('00 Alimenta'!$A:$A,$B176,'00 Alimenta'!D:D)*-1)","v":2668850.25},{"$f":"IF('00 Aggregatore'!$D176=\"R\",SUMIF('00 Alimenta'!$A:$A,$B176,'00 Alimenta'!E:E),SUMIF('00 Alimenta'!$A:$A,$B176,'00 Alimenta'!E:E)*-1)","v":2790651.77}]
["BC","BA1230","Compartecipazione al personale per attività libero professionale intramoenia - Area sanità pubblica","C",{"$f":"IF('00 Aggregatore'!$D177=\"R\",SUMIF('00 Alimenta'!$A:$A,$B177,'00 Alimenta'!D:D),SUMIF('00 Alimenta'!$A:$A,$B177,'00 Alimenta'!D:D)*-1)","v":16818.95},{"$f":"IF('00 Aggregatore'!$D177=\"R\",SUMIF('00 Alimenta'!$A:$A,$B177,'00 Alimenta'!E:E),SUMIF('00 Alimenta'!$A:$A,$B177,'00 Alimenta'!E:E)*-1)","v":19073.689999999999}]
["BC","BA1240","Compartecipazione al personale per attività libero professionale intramoenia - Consulenze (ex art.55 c.1 lett.c), d) ed ex art.57-58)","C",{"$f":"IF('00 Aggregatore'!$D178=\"R\",SUMIF('00 Alimenta'!$A:$A,$B178,'00 Alimenta'!D:D),SUMIF('00 Alimenta'!$A:$A,$B178,'00 Alimenta'!D:D)*-1)","v":444810.38},{"$f":"IF('00 Aggregatore'!$D178=\"R\",SUMIF('00 Alimenta'!$A:$A,$B178,'00 Alimenta'!E:E),SUMIF('00 Alimenta'!$A:$A,$B178,'00 Alimenta'!E:E)*-1)","v":371493.34}]
["BC","BA1250","Compartecipazione al personale per attività libero prof.le intramoenia - Consulenze (ex art.55 c.1 lett.c), d) ed ex art.57-58) (Az.San.Pubbl.Regione)","C",{"$f":"IF('00 Aggregatore'!$D179=\"R\",SUMIF('00 Alimenta'!$A:$A,$B179,'00 Alimenta'!D:D),SUMIF('00 Alimenta'!$A:$A,$B179,'00 Alimenta'!D:D)*-1)","v":0},{"$f":"IF('00 Aggregatore'!$D179=\"R\",SUMIF('00 Alimenta'!$A:$A,$B179,'00 Alimenta'!E:E),SUMIF('00 Alimenta'!$A:$A,$B179,'00 Alimenta'!E:E)*-1)","v":0}]
["BC","BA1260","Compartecipazione al personale per attività libero professionale intramoenia - Altro","C",{"$f":"IF('00 Aggregatore'!$D180=\"R\",SUMIF('00 Alimenta'!$A:$A,$B180,'00 Alimenta'!D:D),SUMIF('00 Alimenta'!$A:$A,$B180,'00 Alimenta'!D:D)*-1)","v":96287.97},{"$f":"IF('00 Aggregatore'!$D180=\"R\",SUMIF('00 Alimenta'!$A:$A,$B180,'00 Alimenta'!E:E),SUMIF('00 Alimenta'!$A:$A,$B180,'00 Alimenta'!E:E)*-1)","v":75468.47}]
["BC","BA1270","Compartecipazione al personale per attività libero professionale intramoenia - Altro (Aziende sanitarie pubbliche della Regione)","C",{"$f":"IF('00 Aggregatore'!$D181=\"R\",SUMIF('00 Alimenta'!$A:$A,$B181,'00 Alimenta'!D:D),SUMIF('00 Alimenta'!$A:$A,$B181,'00 Alimenta'!D:D)*-1)","v":0},{"$f":"IF('00 Aggregatore'!$D181=\"R\",SUMIF('00 Alimenta'!$A:$A,$B181,'00 Alimenta'!E:E),SUMIF('00 Alimenta'!$A:$A,$B181,'00 Alimenta'!E:E)*-1)","v":0}]
["BC","BA1290","Contributi ad associazioni di volontariato","C",{"$f":"IF('00 Aggregatore'!$D182=\"R\",SUMIF('00 Alimenta'!$A:$A,$B182,'00 Alimenta'!D:D),SUMIF('00 Alimenta'!$A:$A,$B182,'00 Alimenta'!D:D)*-1)","v":473982},{"$f":"IF('00 Aggregatore'!$D182=\"R\",SUMIF('00 Alimenta'!$A:$A,$B182,'00 Alimenta'!E:E),SUMIF('00 Alimenta'!$A:$A,$B182,'00 Alimenta'!E:E)*-1)","v":326600}]
["BC","BA1300","Rimborsi per cure all'estero","C",{"$f":"IF('00 Aggregatore'!$D183=\"R\",SUMIF('00 Alimenta'!$A:$A,$B183,'00 Alimenta'!D:D),SUMIF('00 Alimenta'!$A:$A,$B183,'00 Alimenta'!D:D)*-1)","v":15911.61},{"$f":"IF('00 Aggregatore'!$D183=\"R\",SUMIF('00 Alimenta'!$A:$A,$B183,'00 Alimenta'!E:E),SUMIF('00 Alimenta'!$A:$A,$B183,'00 Alimenta'!E:E)*-1)","v":0}]
["BC","BA1310","Contributi a società partecipate e/o enti dipendenti della Regione","C",{"$f":"IF('00 Aggregatore'!$D184=\"R\",SUMIF('00 Alimenta'!$A:$A,$B184,'00 Alimenta'!D:D),SUMIF('00 Alimenta'!$A:$A,$B184,'00 Alimenta'!D:D)*-1)","v":0},{"$f":"IF('00 Aggregatore'!$D184=\"R\",SUMIF('00 Alimenta'!$A:$A,$B184,'00 Alimenta'!E:E),SUMIF('00 Alimenta'!$A:$A,$B184,'00 Alimenta'!E:E)*-1)","v":0}]
["BC","BA1320","Contributo Legge 210/92","C",{"$f":"IF('00 Aggregatore'!$D185=\"R\",SUMIF('00 Alimenta'!$A:$A,$B185,'00 Alimenta'!D:D),SUMIF('00 Alimenta'!$A:$A,$B185,'00 Alimenta'!D:D)*-1)","v":0},{"$f":"IF('00 Aggregatore'!$D185=\"R\",SUMIF('00 Alimenta'!$A:$A,$B185,'00 Alimenta'!E:E),SUMIF('00 Alimenta'!$A:$A,$B185,'00 Alimenta'!E:E)*-1)","v":0}]
["BC","BA1330","Altri rimborsi, assegni e contributi","C",{"$f":"IF('00 Aggregatore'!$D186=\"R\",SUMIF('00 Alimenta'!$A:$A,$B186,'00 Alimenta'!D:D),SUMIF('00 Alimenta'!$A:$A,$B186,'00 Alimenta'!D:D)*-1)","v":1482389.1099999999},{"$f":"IF('00 Aggregatore'!$D186=\"R\",SUMIF('00 Alimenta'!$A:$A,$B186,'00 Alimenta'!E:E),SUMIF('00 Alimenta'!$A:$A,$B186,'00 Alimenta'!E:E)*-1)","v":1424508.4500000002}]
["BC","BA1340","Rimborsi, assegni e contributi v/Aziende sanitarie pubbliche della Regione","C",{"$f":"IF('00 Aggregatore'!$D187=\"R\",SUMIF('00 Alimenta'!$A:$A,$B187,'00 Alimenta'!D:D),SUMIF('00 Alimenta'!$A:$A,$B187,'00 Alimenta'!D:D)*-1)","v":186201},{"$f":"IF('00 Aggregatore'!$D187=\"R\",SUMIF('00 Alimenta'!$A:$A,$B187,'00 Alimenta'!E:E),SUMIF('00 Alimenta'!$A:$A,$B187,'00 Alimenta'!E:E)*-1)","v":80}]
["BC","BA1360","Consulenze sanitarie e socio-sanitarie da Aziende sanitarie pubbliche della Regione","C",{"$f":"IF('00 Aggregatore'!$D188=\"R\",SUMIF('00 Alimenta'!$A:$A,$B188,'00 Alimenta'!D:D),SUMIF('00 Alimenta'!$A:$A,$B188,'00 Alimenta'!D:D)*-1)","v":368369.4},{"$f":"IF('00 Aggregatore'!$D188=\"R\",SUMIF('00 Alimenta'!$A:$A,$B188,'00 Alimenta'!E:E),SUMIF('00 Alimenta'!$A:$A,$B188,'00 Alimenta'!E:E)*-1)","v":298526.69}]
["BC","BA1370","Consulenze sanitarie e socio-sanitarie da terzi - Altri soggetti pubblici","C",{"$f":"IF('00 Aggregatore'!$D189=\"R\",SUMIF('00 Alimenta'!$A:$A,$B189,'00 Alimenta'!D:D),SUMIF('00 Alimenta'!$A:$A,$B189,'00 Alimenta'!D:D)*-1)","v":90118.47},{"$f":"IF('00 Aggregatore'!$D189=\"R\",SUMIF('00 Alimenta'!$A:$A,$B189,'00 Alimenta'!E:E),SUMIF('00 Alimenta'!$A:$A,$B189,'00 Alimenta'!E:E)*-1)","v":24433.75}]
["BC","BA1390","Consulenze sanitarie da privato - Articolo 55, comma 2, CCNL 8 giugno 2000","C",{"$f":"IF('00 Aggregatore'!$D190=\"R\",SUMIF('00 Alimenta'!$A:$A,$B190,'00 Alimenta'!D:D),SUMIF('00 Alimenta'!$A:$A,$B190,'00 Alimenta'!D:D)*-1)","v":2656011.58},{"$f":"IF('00 Aggregatore'!$D190=\"R\",SUMIF('00 Alimenta'!$A:$A,$B190,'00 Alimenta'!E:E),SUMIF('00 Alimenta'!$A:$A,$B190,'00 Alimenta'!E:E)*-1)","v":2372315.1800000002}]
["BC","BA1400","Altre consulenze sanitarie e socio-sanitarie da privato","C",{"$f":"IF('00 Aggregatore'!$D191=\"R\",SUMIF('00 Alimenta'!$A:$A,$B191,'00 Alimenta'!D:D),SUMIF('00 Alimenta'!$A:$A,$B191,'00 Alimenta'!D:D)*-1)","v":9289.34},{"$f":"IF('00 Aggregatore'!$D191=\"R\",SUMIF('00 Alimenta'!$A:$A,$B191,'00 Alimenta'!E:E),SUMIF('00 Alimenta'!$A:$A,$B191,'00 Alimenta'!E:E)*-1)","v":8005.29}]
["BC","BA1410","Collaborazioni coordinate e continuative sanitarie e socio-sanitarie da privato","C",{"$f":"IF('00 Aggregatore'!$D192=\"R\",SUMIF('00 Alimenta'!$A:$A,$B192,'00 Alimenta'!D:D),SUMIF('00 Alimenta'!$A:$A,$B192,'00 Alimenta'!D:D)*-1)","v":13270.74},{"$f":"IF('00 Aggregatore'!$D192=\"R\",SUMIF('00 Alimenta'!$A:$A,$B192,'00 Alimenta'!E:E),SUMIF('00 Alimenta'!$A:$A,$B192,'00 Alimenta'!E:E)*-1)","v":8413.1200000000008}]
["BC","BA1420","Indennità a personale universitario - Area sanitaria","C",{"$f":"IF('00 Aggregatore'!$D193=\"R\",SUMIF('00 Alimenta'!$A:$A,$B193,'00 Alimenta'!D:D),SUMIF('00 Alimenta'!$A:$A,$B193,'00 Alimenta'!D:D)*-1)","v":252571.97},{"$f":"IF('00 Aggregatore'!$D193=\"R\",SUMIF('00 Alimenta'!$A:$A,$B193,'00 Alimenta'!E:E),SUMIF('00 Alimenta'!$A:$A,$B193,'00 Alimenta'!E:E)*-1)","v":242210.34}]
["BC","BA1430","Lavoro interinale - Area sanitaria","C",{"$f":"IF('00 Aggregatore'!$D194=\"R\",SUMIF('00 Alimenta'!$A:$A,$B194,'00 Alimenta'!D:D),SUMIF('00 Alimenta'!$A:$A,$B194,'00 Alimenta'!D:D)*-1)","v":1558908.64},{"$f":"IF('00 Aggregatore'!$D194=\"R\",SUMIF('00 Alimenta'!$A:$A,$B194,'00 Alimenta'!E:E),SUMIF('00 Alimenta'!$A:$A,$B194,'00 Alimenta'!E:E)*-1)","v":2608784.9}]
["BC","BA1440","Altre collaborazioni e prestazioni di lavoro - Area sanitaria","C",{"$f":"IF('00 Aggregatore'!$D195=\"R\",SUMIF('00 Alimenta'!$A:$A,$B195,'00 Alimenta'!D:D),SUMIF('00 Alimenta'!$A:$A,$B195,'00 Alimenta'!D:D)*-1)","v":1213626.8799999999},{"$f":"IF('00 Aggregatore'!$D195=\"R\",SUMIF('00 Alimenta'!$A:$A,$B195,'00 Alimenta'!E:E),SUMIF('00 Alimenta'!$A:$A,$B195,'00 Alimenta'!E:E)*-1)","v":1150772.0999999999}]
["BC","BA1460","Rimborso oneri stipendiali personale sanitario in comando da Aziende sanitarie pubbliche della Regione","C",{"$f":"IF('00 Aggregatore'!$D196=\"R\",SUMIF('00 Alimenta'!$A:$A,$B196,'00 Alimenta'!D:D),SUMIF('00 Alimenta'!$A:$A,$B196,'00 Alimenta'!D:D)*-1)","v":0},{"$f":"IF('00 Aggregatore'!$D196=\"R\",SUMIF('00 Alimenta'!$A:$A,$B196,'00 Alimenta'!E:E),SUMIF('00 Alimenta'!$A:$A,$B196,'00 Alimenta'!E:E)*-1)","v":0}]
["BC","BA1470","Rimborso oneri stipendiali personale sanitario in comando da Regioni, soggetti pubblici e da Università","C",{"$f":"IF('00 Aggregatore'!$D197=\"R\",SUMIF('00 Alimenta'!$A:$A,$B197,'00 Alimenta'!D:D),SUMIF('00 Alimenta'!$A:$A,$B197,'00 Alimenta'!D:D)*-1)","v":0},{"$f":"IF('00 Aggregatore'!$D197=\"R\",SUMIF('00 Alimenta'!$A:$A,$B197,'00 Alimenta'!E:E),SUMIF('00 Alimenta'!$A:$A,$B197,'00 Alimenta'!E:E)*-1)","v":0}]
[{"$f":"LEFT(B198,1)&D198","v":"BC"},"BA1480","Rimborso oneri stipendiali personale sanitario in comando da Aziende di altre Regioni (extra Regione)","C",{"$f":"IF('00 Aggregatore'!$D198=\"R\",SUMIF('00 Alimenta'!$A:$A,$B198,'00 Alimenta'!D:D),SUMIF('00 Alimenta'!$A:$A,$B198,'00 Alimenta'!D:D)*-1)","v":41104.449999999997},{"$f":"IF('00 Aggregatore'!$D198=\"R\",SUMIF('00 Alimenta'!$A:$A,$B198,'00 Alimenta'!E:E),SUMIF('00 Alimenta'!$A:$A,$B198,'00 Alimenta'!E:E)*-1)","v":9790.09}]
["BC","BA1500","Altri servizi sanitari e sociosanitari a rilevanza sanitaria da pubblico - Aziende sanitarie pubbliche della Regione","C",{"$f":"IF('00 Aggregatore'!$D199=\"R\",SUMIF('00 Alimenta'!$A:$A,$B199,'00 Alimenta'!D:D),SUMIF('00 Alimenta'!$A:$A,$B199,'00 Alimenta'!D:D)*-1)","v":50483.02},{"$f":"IF('00 Aggregatore'!$D199=\"R\",SUMIF('00 Alimenta'!$A:$A,$B199,'00 Alimenta'!E:E),SUMIF('00 Alimenta'!$A:$A,$B199,'00 Alimenta'!E:E)*-1)","v":13109.54}]
["BC","BA1510","Altri servizi sanitari e sociosanitari a rilevanza sanitaria da pubblico - Altri soggetti pubblici della Regione","C",{"$f":"IF('00 Aggregatore'!$D200=\"R\",SUMIF('00 Alimenta'!$A:$A,$B200,'00 Alimenta'!D:D),SUMIF('00 Alimenta'!$A:$A,$B200,'00 Alimenta'!D:D)*-1)","v":0},{"$f":"IF('00 Aggregatore'!$D200=\"R\",SUMIF('00 Alimenta'!$A:$A,$B200,'00 Alimenta'!E:E),SUMIF('00 Alimenta'!$A:$A,$B200,'00 Alimenta'!E:E)*-1)","v":0}]
["BC","BA1520","Altri servizi sanitari e sociosanitari a rilevanza sanitaria da pubblico (extra Regione)","C",{"$f":"IF('00 Aggregatore'!$D201=\"R\",SUMIF('00 Alimenta'!$A:$A,$B201,'00 Alimenta'!D:D),SUMIF('00 Alimenta'!$A:$A,$B201,'00 Alimenta'!D:D)*-1)","v":0},{"$f":"IF('00 Aggregatore'!$D201=\"R\",SUMIF('00 Alimenta'!$A:$A,$B201,'00 Alimenta'!E:E),SUMIF('00 Alimenta'!$A:$A,$B201,'00 Alimenta'!E:E)*-1)","v":0}]
["BC","BA1530","Altri servizi sanitari da privato","C",{"$f":"IF('00 Aggregatore'!$D202=\"R\",SUMIF('00 Alimenta'!$A:$A,$B202,'00 Alimenta'!D:D),SUMIF('00 Alimenta'!$A:$A,$B202,'00 Alimenta'!D:D)*-1)","v":2463217.4500000002},{"$f":"IF('00 Aggregatore'!$D202=\"R\",SUMIF('00 Alimenta'!$A:$A,$B202,'00 Alimenta'!E:E),SUMIF('00 Alimenta'!$A:$A,$B202,'00 Alimenta'!E:E)*-1)","v":2741606.08}]
["BC","BA1540","Costi per servizi sanitari - Mobilità internazionale passiva","C",{"$f":"IF('00 Aggregatore'!$D203=\"R\",SUMIF('00 Alimenta'!$A:$A,$B203,'00 Alimenta'!D:D),SUMIF('00 Alimenta'!$A:$A,$B203,'00 Alimenta'!D:D)*-1)","v":0},{"$f":"IF('00 Aggregatore'!$D203=\"R\",SUMIF('00 Alimenta'!$A:$A,$B203,'00 Alimenta'!E:E),SUMIF('00 Alimenta'!$A:$A,$B203,'00 Alimenta'!E:E)*-1)","v":0}]
["BC","BA1550","Costi per differenziale tariffe TUC","C",{"$f":"IF('00 Aggregatore'!$D204=\"R\",SUMIF('00 Alimenta'!$A:$A,$B204,'00 Alimenta'!D:D),SUMIF('00 Alimenta'!$A:$A,$B204,'00 Alimenta'!D:D)*-1)","v":0},{"$f":"IF('00 Aggregatore'!$D204=\"R\",SUMIF('00 Alimenta'!$A:$A,$B204,'00 Alimenta'!E:E),SUMIF('00 Alimenta'!$A:$A,$B204,'00 Alimenta'!E:E)*-1)","v":0}]
["BC","BA1580","Lavanderia","C",{"$f":"IF('00 Aggregatore'!$D205=\"R\",SUMIF('00 Alimenta'!$A:$A,$B205,'00 Alimenta'!D:D),SUMIF('00 Alimenta'!$A:$A,$B205,'00 Alimenta'!D:D)*-1)","v":6717141.3899999997},{"$f":"IF('00 Aggregatore'!$D205=\"R\",SUMIF('00 Alimenta'!$A:$A,$B205,'00 Alimenta'!E:E),SUMIF('00 Alimenta'!$A:$A,$B205,'00 Alimenta'!E:E)*-1)","v":5274953.32}]
["BC","BA1590","Pulizia","C",{"$f":"IF('00 Aggregatore'!$D206=\"R\",SUMIF('00 Alimenta'!$A:$A,$B206,'00 Alimenta'!D:D),SUMIF('00 Alimenta'!$A:$A,$B206,'00 Alimenta'!D:D)*-1)","v":6128265.6900000004},{"$f":"IF('00 Aggregatore'!$D206=\"R\",SUMIF('00 Alimenta'!$A:$A,$B206,'00 Alimenta'!E:E),SUMIF('00 Alimenta'!$A:$A,$B206,'00 Alimenta'!E:E)*-1)","v":6089443.3399999999}]
["BC","BA1600","Mensa","C",{"$f":"IF('00 Aggregatore'!$D207=\"R\",SUMIF('00 Alimenta'!$A:$A,$B207,'00 Alimenta'!D:D),SUMIF('00 Alimenta'!$A:$A,$B207,'00 Alimenta'!D:D)*-1)","v":3982167.1},{"$f":"IF('00 Aggregatore'!$D207=\"R\",SUMIF('00 Alimenta'!$A:$A,$B207,'00 Alimenta'!E:E),SUMIF('00 Alimenta'!$A:$A,$B207,'00 Alimenta'!E:E)*-1)","v":4117793.49}]
["BC","BA1610","Riscaldamento","C",{"$f":"IF('00 Aggregatore'!$D208=\"R\",SUMIF('00 Alimenta'!$A:$A,$B208,'00 Alimenta'!D:D),SUMIF('00 Alimenta'!$A:$A,$B208,'00 Alimenta'!D:D)*-1)","v":1027893.49},{"$f":"IF('00 Aggregatore'!$D208=\"R\",SUMIF('00 Alimenta'!$A:$A,$B208,'00 Alimenta'!E:E),SUMIF('00 Alimenta'!$A:$A,$B208,'00 Alimenta'!E:E)*-1)","v":1064233.96}]
["BC","BA1620","Servizi di assistenza informatica","C",{"$f":"IF('00 Aggregatore'!$D209=\"R\",SUMIF('00 Alimenta'!$A:$A,$B209,'00 Alimenta'!D:D),SUMIF('00 Alimenta'!$A:$A,$B209,'00 Alimenta'!D:D)*-1)","v":1500622.2},{"$f":"IF('00 Aggregatore'!$D209=\"R\",SUMIF('00 Alimenta'!$A:$A,$B209,'00 Alimenta'!E:E),SUMIF('00 Alimenta'!$A:$A,$B209,'00 Alimenta'!E:E)*-1)","v":1666759.65}]
["BC","BA1630","Servizi trasporti (non sanitari)","C",{"$f":"IF('00 Aggregatore'!$D210=\"R\",SUMIF('00 Alimenta'!$A:$A,$B210,'00 Alimenta'!D:D),SUMIF('00 Alimenta'!$A:$A,$B210,'00 Alimenta'!D:D)*-1)","v":0},{"$f":"IF('00 Aggregatore'!$D210=\"R\",SUMIF('00 Alimenta'!$A:$A,$B210,'00 Alimenta'!E:E),SUMIF('00 Alimenta'!$A:$A,$B210,'00 Alimenta'!E:E)*-1)","v":9272}]
["BC","BA1640","Smaltimento rifiuti","C",{"$f":"IF('00 Aggregatore'!$D211=\"R\",SUMIF('00 Alimenta'!$A:$A,$B211,'00 Alimenta'!D:D),SUMIF('00 Alimenta'!$A:$A,$B211,'00 Alimenta'!D:D)*-1)","v":1294794.04},{"$f":"IF('00 Aggregatore'!$D211=\"R\",SUMIF('00 Alimenta'!$A:$A,$B211,'00 Alimenta'!E:E),SUMIF('00 Alimenta'!$A:$A,$B211,'00 Alimenta'!E:E)*-1)","v":1384638.6300000001}]
["BC","BA1650","Utenze telefoniche","C",{"$f":"IF('00 Aggregatore'!$D212=\"R\",SUMIF('00 Alimenta'!$A:$A,$B212,'00 Alimenta'!D:D),SUMIF('00 Alimenta'!$A:$A,$B212,'00 Alimenta'!D:D)*-1)","v":493458.34},{"$f":"IF('00 Aggregatore'!$D212=\"R\",SUMIF('00 Alimenta'!$A:$A,$B212,'00 Alimenta'!E:E),SUMIF('00 Alimenta'!$A:$A,$B212,'00 Alimenta'!E:E)*-1)","v":524835.69999999995}]
["BC","BA1660","Utenze elettricità","C",{"$f":"IF('00 Aggregatore'!$D213=\"R\",SUMIF('00 Alimenta'!$A:$A,$B213,'00 Alimenta'!D:D),SUMIF('00 Alimenta'!$A:$A,$B213,'00 Alimenta'!D:D)*-1)","v":3423484.08},{"$f":"IF('00 Aggregatore'!$D213=\"R\",SUMIF('00 Alimenta'!$A:$A,$B213,'00 Alimenta'!E:E),SUMIF('00 Alimenta'!$A:$A,$B213,'00 Alimenta'!E:E)*-1)","v":3156167.9}]
["BC","BA1670","Altre utenze","C",{"$f":"IF('00 Aggregatore'!$D214=\"R\",SUMIF('00 Alimenta'!$A:$A,$B214,'00 Alimenta'!D:D),SUMIF('00 Alimenta'!$A:$A,$B214,'00 Alimenta'!D:D)*-1)","v":461862.87},{"$f":"IF('00 Aggregatore'!$D214=\"R\",SUMIF('00 Alimenta'!$A:$A,$B214,'00 Alimenta'!E:E),SUMIF('00 Alimenta'!$A:$A,$B214,'00 Alimenta'!E:E)*-1)","v":705877.73}]
["BC","BA1690","Premi di assicurazione - R.C. Professionale","C",{"$f":"IF('00 Aggregatore'!$D215=\"R\",SUMIF('00 Alimenta'!$A:$A,$B215,'00 Alimenta'!D:D),SUMIF('00 Alimenta'!$A:$A,$B215,'00 Alimenta'!D:D)*-1)","v":4540618.17},{"$f":"IF('00 Aggregatore'!$D215=\"R\",SUMIF('00 Alimenta'!$A:$A,$B215,'00 Alimenta'!E:E),SUMIF('00 Alimenta'!$A:$A,$B215,'00 Alimenta'!E:E)*-1)","v":4466553.17}]
["BC","BA1700","Premi di assicurazione - Altri premi assicurativi","C",{"$f":"IF('00 Aggregatore'!$D216=\"R\",SUMIF('00 Alimenta'!$A:$A,$B216,'00 Alimenta'!D:D),SUMIF('00 Alimenta'!$A:$A,$B216,'00 Alimenta'!D:D)*-1)","v":365577.75},{"$f":"IF('00 Aggregatore'!$D216=\"R\",SUMIF('00 Alimenta'!$A:$A,$B216,'00 Alimenta'!E:E),SUMIF('00 Alimenta'!$A:$A,$B216,'00 Alimenta'!E:E)*-1)","v":343462.87}]
["BC","BA1720","Altri servizi non sanitari da pubblico (Aziende sanitarie pubbliche della Regione)","C",{"$f":"IF('00 Aggregatore'!$D217=\"R\",SUMIF('00 Alimenta'!$A:$A,$B217,'00 Alimenta'!D:D),SUMIF('00 Alimenta'!$A:$A,$B217,'00 Alimenta'!D:D)*-1)","v":0},{"$f":"IF('00 Aggregatore'!$D217=\"R\",SUMIF('00 Alimenta'!$A:$A,$B217,'00 Alimenta'!E:E),SUMIF('00 Alimenta'!$A:$A,$B217,'00 Alimenta'!E:E)*-1)","v":0}]
["BC","BA1730","Altri servizi non sanitari da altri soggetti pubblici","C",{"$f":"IF('00 Aggregatore'!$D218=\"R\",SUMIF('00 Alimenta'!$A:$A,$B218,'00 Alimenta'!D:D),SUMIF('00 Alimenta'!$A:$A,$B218,'00 Alimenta'!D:D)*-1)","v":0},{"$f":"IF('00 Aggregatore'!$D218=\"R\",SUMIF('00 Alimenta'!$A:$A,$B218,'00 Alimenta'!E:E),SUMIF('00 Alimenta'!$A:$A,$B218,'00 Alimenta'!E:E)*-1)","v":0}]
["BC","BA1740","Altri servizi non sanitari da privato","C",{"$f":"IF('00 Aggregatore'!$D219=\"R\",SUMIF('00 Alimenta'!$A:$A,$B219,'00 Alimenta'!D:D),SUMIF('00 Alimenta'!$A:$A,$B219,'00 Alimenta'!D:D)*-1)","v":6626072.5000000009},{"$f":"IF('00 Aggregatore'!$D219=\"R\",SUMIF('00 Alimenta'!$A:$A,$B219,'00 Alimenta'!E:E),SUMIF('00 Alimenta'!$A:$A,$B219,'00 Alimenta'!E:E)*-1)","v":6734788.6000000006}]
["BC","BA1760","Consulenze non sanitarie da Aziende sanitarie pubbliche della Regione","C",{"$f":"IF('00 Aggregatore'!$D220=\"R\",SUMIF('00 Alimenta'!$A:$A,$B220,'00 Alimenta'!D:D),SUMIF('00 Alimenta'!$A:$A,$B220,'00 Alimenta'!D:D)*-1)","v":0},{"$f":"IF('00 Aggregatore'!$D220=\"R\",SUMIF('00 Alimenta'!$A:$A,$B220,'00 Alimenta'!E:E),SUMIF('00 Alimenta'!$A:$A,$B220,'00 Alimenta'!E:E)*-1)","v":0}]
["BC","BA1770","Consulenze non sanitarie da Terzi - Altri soggetti pubblici","C",{"$f":"IF('00 Aggregatore'!$D221=\"R\",SUMIF('00 Alimenta'!$A:$A,$B221,'00 Alimenta'!D:D),SUMIF('00 Alimenta'!$A:$A,$B221,'00 Alimenta'!D:D)*-1)","v":0},{"$f":"IF('00 Aggregatore'!$D221=\"R\",SUMIF('00 Alimenta'!$A:$A,$B221,'00 Alimenta'!E:E),SUMIF('00 Alimenta'!$A:$A,$B221,'00 Alimenta'!E:E)*-1)","v":0}]
["BC","BA1790","Consulenze non sanitarie da privato","C",{"$f":"IF('00 Aggregatore'!$D222=\"R\",SUMIF('00 Alimenta'!$A:$A,$B222,'00 Alimenta'!D:D),SUMIF('00 Alimenta'!$A:$A,$B222,'00 Alimenta'!D:D)*-1)","v":614217.07999999996},{"$f":"IF('00 Aggregatore'!$D222=\"R\",SUMIF('00 Alimenta'!$A:$A,$B222,'00 Alimenta'!E:E),SUMIF('00 Alimenta'!$A:$A,$B222,'00 Alimenta'!E:E)*-1)","v":518707.44999999995}]
["BC","BA1800","Collaborazioni coordinate e continuative non sanitarie da privato","C",{"$f":"IF('00 Aggregatore'!$D223=\"R\",SUMIF('00 Alimenta'!$A:$A,$B223,'00 Alimenta'!D:D),SUMIF('00 Alimenta'!$A:$A,$B223,'00 Alimenta'!D:D)*-1)","v":25849.06},{"$f":"IF('00 Aggregatore'!$D223=\"R\",SUMIF('00 Alimenta'!$A:$A,$B223,'00 Alimenta'!E:E),SUMIF('00 Alimenta'!$A:$A,$B223,'00 Alimenta'!E:E)*-1)","v":13535.39}]
["BC","BA1810","Indennità a personale universitario - Area non sanitaria","C",{"$f":"IF('00 Aggregatore'!$D224=\"R\",SUMIF('00 Alimenta'!$A:$A,$B224,'00 Alimenta'!D:D),SUMIF('00 Alimenta'!$A:$A,$B224,'00 Alimenta'!D:D)*-1)","v":0},{"$f":"IF('00 Aggregatore'!$D224=\"R\",SUMIF('00 Alimenta'!$A:$A,$B224,'00 Alimenta'!E:E),SUMIF('00 Alimenta'!$A:$A,$B224,'00 Alimenta'!E:E)*-1)","v":0}]
["BC","BA1820","Lavoro interinale - Area non sanitaria","C",{"$f":"IF('00 Aggregatore'!$D225=\"R\",SUMIF('00 Alimenta'!$A:$A,$B225,'00 Alimenta'!D:D),SUMIF('00 Alimenta'!$A:$A,$B225,'00 Alimenta'!D:D)*-1)","v":0},{"$f":"IF('00 Aggregatore'!$D225=\"R\",SUMIF('00 Alimenta'!$A:$A,$B225,'00 Alimenta'!E:E),SUMIF('00 Alimenta'!$A:$A,$B225,'00 Alimenta'!E:E)*-1)","v":0}]
["BC","BA1830","Altre collaborazioni e prestazioni di lavoro - Area non sanitaria","C",{"$f":"IF('00 Aggregatore'!$D226=\"R\",SUMIF('00 Alimenta'!$A:$A,$B226,'00 Alimenta'!D:D),SUMIF('00 Alimenta'!$A:$A,$B226,'00 Alimenta'!D:D)*-1)","v":91750.23},{"$f":"IF('00 Aggregatore'!$D226=\"R\",SUMIF('00 Alimenta'!$A:$A,$B226,'00 Alimenta'!E:E),SUMIF('00 Alimenta'!$A:$A,$B226,'00 Alimenta'!E:E)*-1)","v":117382.06}]
["BC","BA1850","Rimborso oneri stipendiali personale non sanitario in comando da Aziende sanitarie pubbliche della Regione","C",{"$f":"IF('00 Aggregatore'!$D227=\"R\",SUMIF('00 Alimenta'!$A:$A,$B227,'00 Alimenta'!D:D),SUMIF('00 Alimenta'!$A:$A,$B227,'00 Alimenta'!D:D)*-1)","v":0},{"$f":"IF('00 Aggregatore'!$D227=\"R\",SUMIF('00 Alimenta'!$A:$A,$B227,'00 Alimenta'!E:E),SUMIF('00 Alimenta'!$A:$A,$B227,'00 Alimenta'!E:E)*-1)","v":0}]
["BC","BA1860","Rimborso oneri stipendiali personale non sanitario in comando da Regione, soggetti pubblici e da Università","C",{"$f":"IF('00 Aggregatore'!$D228=\"R\",SUMIF('00 Alimenta'!$A:$A,$B228,'00 Alimenta'!D:D),SUMIF('00 Alimenta'!$A:$A,$B228,'00 Alimenta'!D:D)*-1)","v":0},{"$f":"IF('00 Aggregatore'!$D228=\"R\",SUMIF('00 Alimenta'!$A:$A,$B228,'00 Alimenta'!E:E),SUMIF('00 Alimenta'!$A:$A,$B228,'00 Alimenta'!E:E)*-1)","v":0}]
["BC","BA1870","Rimborso oneri stipendiali personale non sanitario in comando da Aziende di altre Regioni (extra Regione)","C",{"$f":"IF('00 Aggregatore'!$D229=\"R\",SUMIF('00 Alimenta'!$A:$A,$B229,'00 Alimenta'!D:D),SUMIF('00 Alimenta'!$A:$A,$B229,'00 Alimenta'!D:D)*-1)","v":0},{"$f":"IF('00 Aggregatore'!$D229=\"R\",SUMIF('00 Alimenta'!$A:$A,$B229,'00 Alimenta'!E:E),SUMIF('00 Alimenta'!$A:$A,$B229,'00 Alimenta'!E:E)*-1)","v":0}]
["BC","BA1890","Formazione (esternalizzata e non) da pubblico","C",{"$f":"IF('00 Aggregatore'!$D230=\"R\",SUMIF('00 Alimenta'!$A:$A,$B230,'00 Alimenta'!D:D),SUMIF('00 Alimenta'!$A:$A,$B230,'00 Alimenta'!D:D)*-1)","v":67387.399999999994},{"$f":"IF('00 Aggregatore'!$D230=\"R\",SUMIF('00 Alimenta'!$A:$A,$B230,'00 Alimenta'!E:E),SUMIF('00 Alimenta'!$A:$A,$B230,'00 Alimenta'!E:E)*-1)","v":81237.64}]
["BC","BA1900","Formazione (esternalizzata e non) da privato","C",{"$f":"IF('00 Aggregatore'!$D231=\"R\",SUMIF('00 Alimenta'!$A:$A,$B231,'00 Alimenta'!D:D),SUMIF('00 Alimenta'!$A:$A,$B231,'00 Alimenta'!D:D)*-1)","v":561047.22},{"$f":"IF('00 Aggregatore'!$D231=\"R\",SUMIF('00 Alimenta'!$A:$A,$B231,'00 Alimenta'!E:E),SUMIF('00 Alimenta'!$A:$A,$B231,'00 Alimenta'!E:E)*-1)","v":516106.58}]
["BC","BA1920","Manutenzione e riparazione ai fabbricati e loro pertinenze","C",{"$f":"IF('00 Aggregatore'!$D232=\"R\",SUMIF('00 Alimenta'!$A:$A,$B232,'00 Alimenta'!D:D),SUMIF('00 Alimenta'!$A:$A,$B232,'00 Alimenta'!D:D)*-1)","v":7832253.2599999998},{"$f":"IF('00 Aggregatore'!$D232=\"R\",SUMIF('00 Alimenta'!$A:$A,$B232,'00 Alimenta'!E:E),SUMIF('00 Alimenta'!$A:$A,$B232,'00 Alimenta'!E:E)*-1)","v":9244877.5800000001}]
["BC","BA1930","Manutenzione e riparazione agli impianti e macchinari","C",{"$f":"IF('00 Aggregatore'!$D233=\"R\",SUMIF('00 Alimenta'!$A:$A,$B233,'00 Alimenta'!D:D),SUMIF('00 Alimenta'!$A:$A,$B233,'00 Alimenta'!D:D)*-1)","v":0},{"$f":"IF('00 Aggregatore'!$D233=\"R\",SUMIF('00 Alimenta'!$A:$A,$B233,'00 Alimenta'!E:E),SUMIF('00 Alimenta'!$A:$A,$B233,'00 Alimenta'!E:E)*-1)","v":0}]
["BC","BA1940","Manutenzione e riparazione alle attrezzature sanitarie e scientifiche","C",{"$f":"IF('00 Aggregatore'!$D234=\"R\",SUMIF('00 Alimenta'!$A:$A,$B234,'00 Alimenta'!D:D),SUMIF('00 Alimenta'!$A:$A,$B234,'00 Alimenta'!D:D)*-1)","v":5435954.5999999996},{"$f":"IF('00 Aggregatore'!$D234=\"R\",SUMIF('00 Alimenta'!$A:$A,$B234,'00 Alimenta'!E:E),SUMIF('00 Alimenta'!$A:$A,$B234,'00 Alimenta'!E:E)*-1)","v":5502395.79}]
["BC","BA1950","Manutenzione e riparazione ai mobili e arredi","C",{"$f":"IF('00 Aggregatore'!$D235=\"R\",SUMIF('00 Alimenta'!$A:$A,$B235,'00 Alimenta'!D:D),SUMIF('00 Alimenta'!$A:$A,$B235,'00 Alimenta'!D:D)*-1)","v":0},{"$f":"IF('00 Aggregatore'!$D235=\"R\",SUMIF('00 Alimenta'!$A:$A,$B235,'00 Alimenta'!E:E),SUMIF('00 Alimenta'!$A:$A,$B235,'00 Alimenta'!E:E)*-1)","v":0}]
["BC","BA1960","Manutenzione e riparazione agli automezzi","C",{"$f":"IF('00 Aggregatore'!$D236=\"R\",SUMIF('00 Alimenta'!$A:$A,$B236,'00 Alimenta'!D:D),SUMIF('00 Alimenta'!$A:$A,$B236,'00 Alimenta'!D:D)*-1)","v":132622.04},{"$f":"IF('00 Aggregatore'!$D236=\"R\",SUMIF('00 Alimenta'!$A:$A,$B236,'00 Alimenta'!E:E),SUMIF('00 Alimenta'!$A:$A,$B236,'00 Alimenta'!E:E)*-1)","v":109400.27}]
["BC","BA1970","Altre manutenzioni e riparazioni","C",{"$f":"IF('00 Aggregatore'!$D237=\"R\",SUMIF('00 Alimenta'!$A:$A,$B237,'00 Alimenta'!D:D),SUMIF('00 Alimenta'!$A:$A,$B237,'00 Alimenta'!D:D)*-1)","v":907722.94},{"$f":"IF('00 Aggregatore'!$D237=\"R\",SUMIF('00 Alimenta'!$A:$A,$B237,'00 Alimenta'!E:E),SUMIF('00 Alimenta'!$A:$A,$B237,'00 Alimenta'!E:E)*-1)","v":873012.59}]
["BC","BA1980","Manutenzioni e riparazioni da Aziende sanitarie pubbliche della Regione","C",{"$f":"IF('00 Aggregatore'!$D238=\"R\",SUMIF('00 Alimenta'!$A:$A,$B238,'00 Alimenta'!D:D),SUMIF('00 Alimenta'!$A:$A,$B238,'00 Alimenta'!D:D)*-1)","v":0},{"$f":"IF('00 Aggregatore'!$D238=\"R\",SUMIF('00 Alimenta'!$A:$A,$B238,'00 Alimenta'!E:E),SUMIF('00 Alimenta'!$A:$A,$B238,'00 Alimenta'!E:E)*-1)","v":0}]
["BC","BA2000","Fitti passivi","C",{"$f":"IF('00 Aggregatore'!$D239=\"R\",SUMIF('00 Alimenta'!$A:$A,$B239,'00 Alimenta'!D:D),SUMIF('00 Alimenta'!$A:$A,$B239,'00 Alimenta'!D:D)*-1)","v":1206607.57},{"$f":"IF('00 Aggregatore'!$D239=\"R\",SUMIF('00 Alimenta'!$A:$A,$B239,'00 Alimenta'!E:E),SUMIF('00 Alimenta'!$A:$A,$B239,'00 Alimenta'!E:E)*-1)","v":1239352.47}]
["BC","BA2020","Canoni di noleggio - Area sanitaria","C",{"$f":"IF('00 Aggregatore'!$D240=\"R\",SUMIF('00 Alimenta'!$A:$A,$B240,'00 Alimenta'!D:D),SUMIF('00 Alimenta'!$A:$A,$B240,'00 Alimenta'!D:D)*-1)","v":4860200.24},{"$f":"IF('00 Aggregatore'!$D240=\"R\",SUMIF('00 Alimenta'!$A:$A,$B240,'00 Alimenta'!E:E),SUMIF('00 Alimenta'!$A:$A,$B240,'00 Alimenta'!E:E)*-1)","v":4790860.33}]
["BC","BA2030","Canoni di noleggio - Area non sanitaria","C",{"$f":"IF('00 Aggregatore'!$D241=\"R\",SUMIF('00 Alimenta'!$A:$A,$B241,'00 Alimenta'!D:D),SUMIF('00 Alimenta'!$A:$A,$B241,'00 Alimenta'!D:D)*-1)","v":484270.73000000004},{"$f":"IF('00 Aggregatore'!$D241=\"R\",SUMIF('00 Alimenta'!$A:$A,$B241,'00 Alimenta'!E:E),SUMIF('00 Alimenta'!$A:$A,$B241,'00 Alimenta'!E:E)*-1)","v":462059.44}]
["BC","BA2050","Canoni di leasing - Area sanitaria","C",{"$f":"IF('00 Aggregatore'!$D242=\"R\",SUMIF('00 Alimenta'!$A:$A,$B242,'00 Alimenta'!D:D),SUMIF('00 Alimenta'!$A:$A,$B242,'00 Alimenta'!D:D)*-1)","v":986370},{"$f":"IF('00 Aggregatore'!$D242=\"R\",SUMIF('00 Alimenta'!$A:$A,$B242,'00 Alimenta'!E:E),SUMIF('00 Alimenta'!$A:$A,$B242,'00 Alimenta'!E:E)*-1)","v":0}]
["BC","BA2060","Canoni di leasing - Area non sanitaria","C",{"$f":"IF('00 Aggregatore'!$D243=\"R\",SUMIF('00 Alimenta'!$A:$A,$B243,'00 Alimenta'!D:D),SUMIF('00 Alimenta'!$A:$A,$B243,'00 Alimenta'!D:D)*-1)","v":0},{"$f":"IF('00 Aggregatore'!$D243=\"R\",SUMIF('00 Alimenta'!$A:$A,$B243,'00 Alimenta'!E:E),SUMIF('00 Alimenta'!$A:$A,$B243,'00 Alimenta'!E:E)*-1)","v":0}]
["BC","BA2070","Locazioni e noleggi da Aziende sanitarie pubbliche della Regione","C",{"$f":"IF('00 Aggregatore'!$D244=\"R\",SUMIF('00 Alimenta'!$A:$A,$B244,'00 Alimenta'!D:D),SUMIF('00 Alimenta'!$A:$A,$B244,'00 Alimenta'!D:D)*-1)","v":0},{"$f":"IF('00 Aggregatore'!$D244=\"R\",SUMIF('00 Alimenta'!$A:$A,$B244,'00 Alimenta'!E:E),SUMIF('00 Alimenta'!$A:$A,$B244,'00 Alimenta'!E:E)*-1)","v":0}]
["BC","BA2120","Costo del personale dirigente medico - Tempo indeterminato","C",{"$f":"IF('00 Aggregatore'!$D245=\"R\",SUMIF('00 Alimenta'!$A:$A,$B245,'00 Alimenta'!D:D),SUMIF('00 Alimenta'!$A:$A,$B245,'00 Alimenta'!D:D)*-1)","v":67708491.459999993},{"$f":"IF('00 Aggregatore'!$D245=\"R\",SUMIF('00 Alimenta'!$A:$A,$B245,'00 Alimenta'!E:E),SUMIF('00 Alimenta'!$A:$A,$B245,'00 Alimenta'!E:E)*-1)","v":66243178.869999997}]
["BC","BA2130","Costo del personale dirigente medico - Tempo determinato","C",{"$f":"IF('00 Aggregatore'!$D246=\"R\",SUMIF('00 Alimenta'!$A:$A,$B246,'00 Alimenta'!D:D),SUMIF('00 Alimenta'!$A:$A,$B246,'00 Alimenta'!D:D)*-1)","v":1484449.36},{"$f":"IF('00 Aggregatore'!$D246=\"R\",SUMIF('00 Alimenta'!$A:$A,$B246,'00 Alimenta'!E:E),SUMIF('00 Alimenta'!$A:$A,$B246,'00 Alimenta'!E:E)*-1)","v":1905680.32}]
["BC","BA2140","Costo del personale dirigente medico - Altro","C",{"$f":"IF('00 Aggregatore'!$D247=\"R\",SUMIF('00 Alimenta'!$A:$A,$B247,'00 Alimenta'!D:D),SUMIF('00 Alimenta'!$A:$A,$B247,'00 Alimenta'!D:D)*-1)","v":0},{"$f":"IF('00 Aggregatore'!$D247=\"R\",SUMIF('00 Alimenta'!$A:$A,$B247,'00 Alimenta'!E:E),SUMIF('00 Alimenta'!$A:$A,$B247,'00 Alimenta'!E:E)*-1)","v":0}]
["BC","BA2160","Costo del personale dirigente non medico - Tempo indeterminato","C",{"$f":"IF('00 Aggregatore'!$D248=\"R\",SUMIF('00 Alimenta'!$A:$A,$B248,'00 Alimenta'!D:D),SUMIF('00 Alimenta'!$A:$A,$B248,'00 Alimenta'!D:D)*-1)","v":5069887.5500000007},{"$f":"IF('00 Aggregatore'!$D248=\"R\",SUMIF('00 Alimenta'!$A:$A,$B248,'00 Alimenta'!E:E),SUMIF('00 Alimenta'!$A:$A,$B248,'00 Alimenta'!E:E)*-1)","v":5064518.01}]
["BC","BA2170","Costo del personale dirigente non medico - Tempo determinato","C",{"$f":"IF('00 Aggregatore'!$D249=\"R\",SUMIF('00 Alimenta'!$A:$A,$B249,'00 Alimenta'!D:D),SUMIF('00 Alimenta'!$A:$A,$B249,'00 Alimenta'!D:D)*-1)","v":63548.549999999996},{"$f":"IF('00 Aggregatore'!$D249=\"R\",SUMIF('00 Alimenta'!$A:$A,$B249,'00 Alimenta'!E:E),SUMIF('00 Alimenta'!$A:$A,$B249,'00 Alimenta'!E:E)*-1)","v":104896.52000000002}]
["BC","BA2180","Costo del personale dirigente non medico - Altro","C",{"$f":"IF('00 Aggregatore'!$D250=\"R\",SUMIF('00 Alimenta'!$A:$A,$B250,'00 Alimenta'!D:D),SUMIF('00 Alimenta'!$A:$A,$B250,'00 Alimenta'!D:D)*-1)","v":0},{"$f":"IF('00 Aggregatore'!$D250=\"R\",SUMIF('00 Alimenta'!$A:$A,$B250,'00 Alimenta'!E:E),SUMIF('00 Alimenta'!$A:$A,$B250,'00 Alimenta'!E:E)*-1)","v":0}]
["BC","BA2200","Costo del personale comparto ruolo sanitario - Tempo indeterminato","C",{"$f":"IF('00 Aggregatore'!$D251=\"R\",SUMIF('00 Alimenta'!$A:$A,$B251,'00 Alimenta'!D:D),SUMIF('00 Alimenta'!$A:$A,$B251,'00 Alimenta'!D:D)*-1)","v":65460246.470000006},{"$f":"IF('00 Aggregatore'!$D251=\"R\",SUMIF('00 Alimenta'!$A:$A,$B251,'00 Alimenta'!E:E),SUMIF('00 Alimenta'!$A:$A,$B251,'00 Alimenta'!E:E)*-1)","v":64044509.309999995}]
["BC","BA2210","Costo del personale comparto ruolo sanitario - Tempo determinato","C",{"$f":"IF('00 Aggregatore'!$D252=\"R\",SUMIF('00 Alimenta'!$A:$A,$B252,'00 Alimenta'!D:D),SUMIF('00 Alimenta'!$A:$A,$B252,'00 Alimenta'!D:D)*-1)","v":561260.09},{"$f":"IF('00 Aggregatore'!$D252=\"R\",SUMIF('00 Alimenta'!$A:$A,$B252,'00 Alimenta'!E:E),SUMIF('00 Alimenta'!$A:$A,$B252,'00 Alimenta'!E:E)*-1)","v":812435.66}]
["BC","BA2220","Costo del personale comparto ruolo sanitario - Altro","C",{"$f":"IF('00 Aggregatore'!$D253=\"R\",SUMIF('00 Alimenta'!$A:$A,$B253,'00 Alimenta'!D:D),SUMIF('00 Alimenta'!$A:$A,$B253,'00 Alimenta'!D:D)*-1)","v":0},{"$f":"IF('00 Aggregatore'!$D253=\"R\",SUMIF('00 Alimenta'!$A:$A,$B253,'00 Alimenta'!E:E),SUMIF('00 Alimenta'!$A:$A,$B253,'00 Alimenta'!E:E)*-1)","v":0}]
["BC","BA2250","Costo del personale dirigente ruolo professionale - Tempo indeterminato","C",{"$f":"IF('00 Aggregatore'!$D254=\"R\",SUMIF('00 Alimenta'!$A:$A,$B254,'00 Alimenta'!D:D),SUMIF('00 Alimenta'!$A:$A,$B254,'00 Alimenta'!D:D)*-1)","v":343146.87},{"$f":"IF('00 Aggregatore'!$D254=\"R\",SUMIF('00 Alimenta'!$A:$A,$B254,'00 Alimenta'!E:E),SUMIF('00 Alimenta'!$A:$A,$B254,'00 Alimenta'!E:E)*-1)","v":404674.32}]
["BC","BA2260","Costo del personale dirigente ruolo professionale - Tempo determinato","C",{"$f":"IF('00 Aggregatore'!$D255=\"R\",SUMIF('00 Alimenta'!$A:$A,$B255,'00 Alimenta'!D:D),SUMIF('00 Alimenta'!$A:$A,$B255,'00 Alimenta'!D:D)*-1)","v":73208.239999999991},{"$f":"IF('00 Aggregatore'!$D255=\"R\",SUMIF('00 Alimenta'!$A:$A,$B255,'00 Alimenta'!E:E),SUMIF('00 Alimenta'!$A:$A,$B255,'00 Alimenta'!E:E)*-1)","v":21123.85}]
["BC","BA2270","Costo del personale dirigente ruolo professionale - Altro","C",{"$f":"IF('00 Aggregatore'!$D256=\"R\",SUMIF('00 Alimenta'!$A:$A,$B256,'00 Alimenta'!D:D),SUMIF('00 Alimenta'!$A:$A,$B256,'00 Alimenta'!D:D)*-1)","v":0},{"$f":"IF('00 Aggregatore'!$D256=\"R\",SUMIF('00 Alimenta'!$A:$A,$B256,'00 Alimenta'!E:E),SUMIF('00 Alimenta'!$A:$A,$B256,'00 Alimenta'!E:E)*-1)","v":0}]
["BC","BA2290","Costo del personale comparto ruolo professionale - Tempo indeterminato","C",{"$f":"IF('00 Aggregatore'!$D257=\"R\",SUMIF('00 Alimenta'!$A:$A,$B257,'00 Alimenta'!D:D),SUMIF('00 Alimenta'!$A:$A,$B257,'00 Alimenta'!D:D)*-1)","v":35022.480000000003},{"$f":"IF('00 Aggregatore'!$D257=\"R\",SUMIF('00 Alimenta'!$A:$A,$B257,'00 Alimenta'!E:E),SUMIF('00 Alimenta'!$A:$A,$B257,'00 Alimenta'!E:E)*-1)","v":12403.57}]
["BC","BA2300","Costo del personale comparto ruolo professionale - Tempo determinato","C",{"$f":"IF('00 Aggregatore'!$D258=\"R\",SUMIF('00 Alimenta'!$A:$A,$B258,'00 Alimenta'!D:D),SUMIF('00 Alimenta'!$A:$A,$B258,'00 Alimenta'!D:D)*-1)","v":0},{"$f":"IF('00 Aggregatore'!$D258=\"R\",SUMIF('00 Alimenta'!$A:$A,$B258,'00 Alimenta'!E:E),SUMIF('00 Alimenta'!$A:$A,$B258,'00 Alimenta'!E:E)*-1)","v":0}]
["BC","BA2310","Costo del personale comparto ruolo professionale - Altro","C",{"$f":"IF('00 Aggregatore'!$D259=\"R\",SUMIF('00 Alimenta'!$A:$A,$B259,'00 Alimenta'!D:D),SUMIF('00 Alimenta'!$A:$A,$B259,'00 Alimenta'!D:D)*-1)","v":0},{"$f":"IF('00 Aggregatore'!$D259=\"R\",SUMIF('00 Alimenta'!$A:$A,$B259,'00 Alimenta'!E:E),SUMIF('00 Alimenta'!$A:$A,$B259,'00 Alimenta'!E:E)*-1)","v":0}]
["BC","BA2340","Costo del personale dirigente ruolo tecnico - Tempo indeterminato","C",{"$f":"IF('00 Aggregatore'!$D260=\"R\",SUMIF('00 Alimenta'!$A:$A,$B260,'00 Alimenta'!D:D),SUMIF('00 Alimenta'!$A:$A,$B260,'00 Alimenta'!D:D)*-1)","v":482150.58999999997},{"$f":"IF('00 Aggregatore'!$D260=\"R\",SUMIF('00 Alimenta'!$A:$A,$B260,'00 Alimenta'!E:E),SUMIF('00 Alimenta'!$A:$A,$B260,'00 Alimenta'!E:E)*-1)","v":375739.52999999997}]
["BC","BA2350","Costo del personale dirigente ruolo tecnico - Tempo determinato","C",{"$f":"IF('00 Aggregatore'!$D261=\"R\",SUMIF('00 Alimenta'!$A:$A,$B261,'00 Alimenta'!D:D),SUMIF('00 Alimenta'!$A:$A,$B261,'00 Alimenta'!D:D)*-1)","v":0},{"$f":"IF('00 Aggregatore'!$D261=\"R\",SUMIF('00 Alimenta'!$A:$A,$B261,'00 Alimenta'!E:E),SUMIF('00 Alimenta'!$A:$A,$B261,'00 Alimenta'!E:E)*-1)","v":0}]
[{"$f":"LEFT(B262,1)&D262","v":"BC"},"BA2360","Costo del personale dirigente ruolo tecnico - Altro","C",{"$f":"IF('00 Aggregatore'!$D262=\"R\",SUMIF('00 Alimenta'!$A:$A,$B262,'00 Alimenta'!D:D),SUMIF('00 Alimenta'!$A:$A,$B262,'00 Alimenta'!D:D)*-1)","v":0},{"$f":"IF('00 Aggregatore'!$D262=\"R\",SUMIF('00 Alimenta'!$A:$A,$B262,'00 Alimenta'!E:E),SUMIF('00 Alimenta'!$A:$A,$B262,'00 Alimenta'!E:E)*-1)","v":0}]
["BC","BA2380","Costo del personale comparto ruolo tecnico - Tempo indeterminato","C",{"$f":"IF('00 Aggregatore'!$D263=\"R\",SUMIF('00 Alimenta'!$A:$A,$B263,'00 Alimenta'!D:D),SUMIF('00 Alimenta'!$A:$A,$B263,'00 Alimenta'!D:D)*-1)","v":15879905.449999999},{"$f":"IF('00 Aggregatore'!$D263=\"R\",SUMIF('00 Alimenta'!$A:$A,$B263,'00 Alimenta'!E:E),SUMIF('00 Alimenta'!$A:$A,$B263,'00 Alimenta'!E:E)*-1)","v":15963506.970000001}]
["BC","BA2390","Costo del personale comparto ruolo tecnico - Tempo determinato","C",{"$f":"IF('00 Aggregatore'!$D264=\"R\",SUMIF('00 Alimenta'!$A:$A,$B264,'00 Alimenta'!D:D),SUMIF('00 Alimenta'!$A:$A,$B264,'00 Alimenta'!D:D)*-1)","v":408467.97},{"$f":"IF('00 Aggregatore'!$D264=\"R\",SUMIF('00 Alimenta'!$A:$A,$B264,'00 Alimenta'!E:E),SUMIF('00 Alimenta'!$A:$A,$B264,'00 Alimenta'!E:E)*-1)","v":177223.65000000002}]
["BC","BA2400","Costo del personale comparto ruolo tecnico - Altro","C",{"$f":"IF('00 Aggregatore'!$D265=\"R\",SUMIF('00 Alimenta'!$A:$A,$B265,'00 Alimenta'!D:D),SUMIF('00 Alimenta'!$A:$A,$B265,'00 Alimenta'!D:D)*-1)","v":0},{"$f":"IF('00 Aggregatore'!$D265=\"R\",SUMIF('00 Alimenta'!$A:$A,$B265,'00 Alimenta'!E:E),SUMIF('00 Alimenta'!$A:$A,$B265,'00 Alimenta'!E:E)*-1)","v":0}]
["BC","BA2430","Costo del personale dirigente ruolo amministrativo - Tempo indeterminato","C",{"$f":"IF('00 Aggregatore'!$D266=\"R\",SUMIF('00 Alimenta'!$A:$A,$B266,'00 Alimenta'!D:D),SUMIF('00 Alimenta'!$A:$A,$B266,'00 Alimenta'!D:D)*-1)","v":787868.7},{"$f":"IF('00 Aggregatore'!$D266=\"R\",SUMIF('00 Alimenta'!$A:$A,$B266,'00 Alimenta'!E:E),SUMIF('00 Alimenta'!$A:$A,$B266,'00 Alimenta'!E:E)*-1)","v":824224.55}]
["BC","BA2440","Costo del personale dirigente ruolo amministrativo - Tempo determinato","C",{"$f":"IF('00 Aggregatore'!$D267=\"R\",SUMIF('00 Alimenta'!$A:$A,$B267,'00 Alimenta'!D:D),SUMIF('00 Alimenta'!$A:$A,$B267,'00 Alimenta'!D:D)*-1)","v":0},{"$f":"IF('00 Aggregatore'!$D267=\"R\",SUMIF('00 Alimenta'!$A:$A,$B267,'00 Alimenta'!E:E),SUMIF('00 Alimenta'!$A:$A,$B267,'00 Alimenta'!E:E)*-1)","v":0}]
["BC","BA2450","Costo del personale dirigente ruolo amministrativo - Altro","C",{"$f":"IF('00 Aggregatore'!$D268=\"R\",SUMIF('00 Alimenta'!$A:$A,$B268,'00 Alimenta'!D:D),SUMIF('00 Alimenta'!$A:$A,$B268,'00 Alimenta'!D:D)*-1)","v":0},{"$f":"IF('00 Aggregatore'!$D268=\"R\",SUMIF('00 Alimenta'!$A:$A,$B268,'00 Alimenta'!E:E),SUMIF('00 Alimenta'!$A:$A,$B268,'00 Alimenta'!E:E)*-1)","v":0}]
["BC","BA2470","Costo del personale comparto ruolo amministrativo - Tempo indeterminato","C",{"$f":"IF('00 Aggregatore'!$D269=\"R\",SUMIF('00 Alimenta'!$A:$A,$B269,'00 Alimenta'!D:D),SUMIF('00 Alimenta'!$A:$A,$B269,'00 Alimenta'!D:D)*-1)","v":9385507.379999999},{"$f":"IF('00 Aggregatore'!$D269=\"R\",SUMIF('00 Alimenta'!$A:$A,$B269,'00 Alimenta'!E:E),SUMIF('00 Alimenta'!$A:$A,$B269,'00 Alimenta'!E:E)*-1)","v":9288718.9999999981}]
["BC","BA2480","Costo del personale comparto ruolo amministrativo - Tempo determinato","C",{"$f":"IF('00 Aggregatore'!$D270=\"R\",SUMIF('00 Alimenta'!$A:$A,$B270,'00 Alimenta'!D:D),SUMIF('00 Alimenta'!$A:$A,$B270,'00 Alimenta'!D:D)*-1)","v":867.58},{"$f":"IF('00 Aggregatore'!$D270=\"R\",SUMIF('00 Alimenta'!$A:$A,$B270,'00 Alimenta'!E:E),SUMIF('00 Alimenta'!$A:$A,$B270,'00 Alimenta'!E:E)*-1)","v":1368.31}]
["BC","BA2490","Costo del personale comparto ruolo amministrativo - Altro","C",{"$f":"IF('00 Aggregatore'!$D271=\"R\",SUMIF('00 Alimenta'!$A:$A,$B271,'00 Alimenta'!D:D),SUMIF('00 Alimenta'!$A:$A,$B271,'00 Alimenta'!D:D)*-1)","v":0},{"$f":"IF('00 Aggregatore'!$D271=\"R\",SUMIF('00 Alimenta'!$A:$A,$B271,'00 Alimenta'!E:E),SUMIF('00 Alimenta'!$A:$A,$B271,'00 Alimenta'!E:E)*-1)","v":0}]
["BC","BA2510","Imposte e tasse (escluso IRAP e IRES)","C",{"$f":"IF('00 Aggregatore'!$D272=\"R\",SUMIF('00 Alimenta'!$A:$A,$B272,'00 Alimenta'!D:D),SUMIF('00 Alimenta'!$A:$A,$B272,'00 Alimenta'!D:D)*-1)","v":1055569.6099999999},{"$f":"IF('00 Aggregatore'!$D272=\"R\",SUMIF('00 Alimenta'!$A:$A,$B272,'00 Alimenta'!E:E),SUMIF('00 Alimenta'!$A:$A,$B272,'00 Alimenta'!E:E)*-1)","v":1160574.8}]
["BC","BA2520","Perdite su crediti","C",{"$f":"IF('00 Aggregatore'!$D273=\"R\",SUMIF('00 Alimenta'!$A:$A,$B273,'00 Alimenta'!D:D),SUMIF('00 Alimenta'!$A:$A,$B273,'00 Alimenta'!D:D)*-1)","v":0},{"$f":"IF('00 Aggregatore'!$D273=\"R\",SUMIF('00 Alimenta'!$A:$A,$B273,'00 Alimenta'!E:E),SUMIF('00 Alimenta'!$A:$A,$B273,'00 Alimenta'!E:E)*-1)","v":0}]
["BC","BA2540","Indennità, rimborso spese e oneri sociali per gli Organi Direttivi e Collegio Sindacale","C",{"$f":"IF('00 Aggregatore'!$D274=\"R\",SUMIF('00 Alimenta'!$A:$A,$B274,'00 Alimenta'!D:D),SUMIF('00 Alimenta'!$A:$A,$B274,'00 Alimenta'!D:D)*-1)","v":1434574.81},{"$f":"IF('00 Aggregatore'!$D274=\"R\",SUMIF('00 Alimenta'!$A:$A,$B274,'00 Alimenta'!E:E),SUMIF('00 Alimenta'!$A:$A,$B274,'00 Alimenta'!E:E)*-1)","v":1430687.1400000001}]
["BC","BA2550","Altri oneri diversi di gestione","C",{"$f":"IF('00 Aggregatore'!$D275=\"R\",SUMIF('00 Alimenta'!$A:$A,$B275,'00 Alimenta'!D:D),SUMIF('00 Alimenta'!$A:$A,$B275,'00 Alimenta'!D:D)*-1)","v":352590.83},{"$f":"IF('00 Aggregatore'!$D275=\"R\",SUMIF('00 Alimenta'!$A:$A,$B275,'00 Alimenta'!E:E),SUMIF('00 Alimenta'!$A:$A,$B275,'00 Alimenta'!E:E)*-1)","v":292884.42000000004}]
["BC","BA2570","Ammortamenti delle immobilizzazioni immateriali","C",{"$f":"IF('00 Aggregatore'!$D276=\"R\",SUMIF('00 Alimenta'!$A:$A,$B276,'00 Alimenta'!D:D),SUMIF('00 Alimenta'!$A:$A,$B276,'00 Alimenta'!D:D)*-1)","v":105301.39},{"$f":"IF('00 Aggregatore'!$D276=\"R\",SUMIF('00 Alimenta'!$A:$A,$B276,'00 Alimenta'!E:E),SUMIF('00 Alimenta'!$A:$A,$B276,'00 Alimenta'!E:E)*-1)","v":136552.39000000001}]
["BC","BA2600","Ammortamenti fabbricati non strumentali (disponibili)","C",{"$f":"IF('00 Aggregatore'!$D277=\"R\",SUMIF('00 Alimenta'!$A:$A,$B277,'00 Alimenta'!D:D),SUMIF('00 Alimenta'!$A:$A,$B277,'00 Alimenta'!D:D)*-1)","v":0},{"$f":"IF('00 Aggregatore'!$D277=\"R\",SUMIF('00 Alimenta'!$A:$A,$B277,'00 Alimenta'!E:E),SUMIF('00 Alimenta'!$A:$A,$B277,'00 Alimenta'!E:E)*-1)","v":0}]
["BC","BA2610","Ammortamenti fabbricati strumentali (indisponibili)","C",{"$f":"IF('00 Aggregatore'!$D278=\"R\",SUMIF('00 Alimenta'!$A:$A,$B278,'00 Alimenta'!D:D),SUMIF('00 Alimenta'!$A:$A,$B278,'00 Alimenta'!D:D)*-1)","v":4970287.05},{"$f":"IF('00 Aggregatore'!$D278=\"R\",SUMIF('00 Alimenta'!$A:$A,$B278,'00 Alimenta'!E:E),SUMIF('00 Alimenta'!$A:$A,$B278,'00 Alimenta'!E:E)*-1)","v":4970287.05}]
["BC","BA2620","Ammortamento dei fabbricati","C",{"$f":"IF('00 Aggregatore'!$D279=\"R\",SUMIF('00 Alimenta'!$A:$A,$B279,'00 Alimenta'!D:D),SUMIF('00 Alimenta'!$A:$A,$B279,'00 Alimenta'!D:D)*-1)","v":3901825.47},{"$f":"IF('00 Aggregatore'!$D279=\"R\",SUMIF('00 Alimenta'!$A:$A,$B279,'00 Alimenta'!E:E),SUMIF('00 Alimenta'!$A:$A,$B279,'00 Alimenta'!E:E)*-1)","v":5155538.32}]
["BC","BA2640","Svalutazione delle immobilizzazioni immateriali e materiali","C",{"$f":"IF('00 Aggregatore'!$D280=\"R\",SUMIF('00 Alimenta'!$A:$A,$B280,'00 Alimenta'!D:D),SUMIF('00 Alimenta'!$A:$A,$B280,'00 Alimenta'!D:D)*-1)","v":0},{"$f":"IF('00 Aggregatore'!$D280=\"R\",SUMIF('00 Alimenta'!$A:$A,$B280,'00 Alimenta'!E:E),SUMIF('00 Alimenta'!$A:$A,$B280,'00 Alimenta'!E:E)*-1)","v":0}]
["BC","BA2650","Svalutazione dei crediti","C",{"$f":"IF('00 Aggregatore'!$D281=\"R\",SUMIF('00 Alimenta'!$A:$A,$B281,'00 Alimenta'!D:D),SUMIF('00 Alimenta'!$A:$A,$B281,'00 Alimenta'!D:D)*-1)","v":0},{"$f":"IF('00 Aggregatore'!$D281=\"R\",SUMIF('00 Alimenta'!$A:$A,$B281,'00 Alimenta'!E:E),SUMIF('00 Alimenta'!$A:$A,$B281,'00 Alimenta'!E:E)*-1)","v":0}]
["BC","BA2670","Variazione rimanenze sanitarie","C",{"$f":"IF('00 Aggregatore'!$D282=\"R\",SUMIF('00 Alimenta'!$A:$A,$B282,'00 Alimenta'!D:D),SUMIF('00 Alimenta'!$A:$A,$B282,'00 Alimenta'!D:D)*-1)","v":710402.75},{"$f":"IF('00 Aggregatore'!$D282=\"R\",SUMIF('00 Alimenta'!$A:$A,$B282,'00 Alimenta'!E:E),SUMIF('00 Alimenta'!$A:$A,$B282,'00 Alimenta'!E:E)*-1)","v":-1167703.8400000005}]
["BC","BA2680","Variazione rimanenze non sanitarie","C",{"$f":"IF('00 Aggregatore'!$D283=\"R\",SUMIF('00 Alimenta'!$A:$A,$B283,'00 Alimenta'!D:D),SUMIF('00 Alimenta'!$A:$A,$B283,'00 Alimenta'!D:D)*-1)","v":100485.89000000006},{"$f":"IF('00 Aggregatore'!$D283=\"R\",SUMIF('00 Alimenta'!$A:$A,$B283,'00 Alimenta'!E:E),SUMIF('00 Alimenta'!$A:$A,$B283,'00 Alimenta'!E:E)*-1)","v":-54390.610000000037}]
["BC","BA2710","Accantonamenti per cause civili e oneri processuali","C",{"$f":"IF('00 Aggregatore'!$D284=\"R\",SUMIF('00 Alimenta'!$A:$A,$B284,'00 Alimenta'!D:D),SUMIF('00 Alimenta'!$A:$A,$B284,'00 Alimenta'!D:D)*-1)","v":2008370.76},{"$f":"IF('00 Aggregatore'!$D284=\"R\",SUMIF('00 Alimenta'!$A:$A,$B284,'00 Alimenta'!E:E),SUMIF('00 Alimenta'!$A:$A,$B284,'00 Alimenta'!E:E)*-1)","v":9268206.2400000002}]
["BC","BA2720","Accantonamenti per contenzioso personale dipendente","C",{"$f":"IF('00 Aggregatore'!$D285=\"R\",SUMIF('00 Alimenta'!$A:$A,$B285,'00 Alimenta'!D:D),SUMIF('00 Alimenta'!$A:$A,$B285,'00 Alimenta'!D:D)*-1)","v":665916.56999999995},{"$f":"IF('00 Aggregatore'!$D285=\"R\",SUMIF('00 Alimenta'!$A:$A,$B285,'00 Alimenta'!E:E),SUMIF('00 Alimenta'!$A:$A,$B285,'00 Alimenta'!E:E)*-1)","v":562892.11}]
["BC","BA2730","Accantonamenti per rischi connessi all'acquisto di prestazioni sanitarie da privato","C",{"$f":"IF('00 Aggregatore'!$D286=\"R\",SUMIF('00 Alimenta'!$A:$A,$B286,'00 Alimenta'!D:D),SUMIF('00 Alimenta'!$A:$A,$B286,'00 Alimenta'!D:D)*-1)","v":0},{"$f":"IF('00 Aggregatore'!$D286=\"R\",SUMIF('00 Alimenta'!$A:$A,$B286,'00 Alimenta'!E:E),SUMIF('00 Alimenta'!$A:$A,$B286,'00 Alimenta'!E:E)*-1)","v":4358962}]
["BC","BA2740","Accantonamenti per copertura diretta dei rischi (autoassicurazione)","C",{"$f":"IF('00 Aggregatore'!$D287=\"R\",SUMIF('00 Alimenta'!$A:$A,$B287,'00 Alimenta'!D:D),SUMIF('00 Alimenta'!$A:$A,$B287,'00 Alimenta'!D:D)*-1)","v":3681140.26},{"$f":"IF('00 Aggregatore'!$D287=\"R\",SUMIF('00 Alimenta'!$A:$A,$B287,'00 Alimenta'!E:E),SUMIF('00 Alimenta'!$A:$A,$B287,'00 Alimenta'!E:E)*-1)","v":3111381.31}]
["BC","BA2750","Altri accantonamenti per rischi","C",{"$f":"IF('00 Aggregatore'!$D288=\"R\",SUMIF('00 Alimenta'!$A:$A,$B288,'00 Alimenta'!D:D),SUMIF('00 Alimenta'!$A:$A,$B288,'00 Alimenta'!D:D)*-1)","v":0},{"$f":"IF('00 Aggregatore'!$D288=\"R\",SUMIF('00 Alimenta'!$A:$A,$B288,'00 Alimenta'!E:E),SUMIF('00 Alimenta'!$A:$A,$B288,'00 Alimenta'!E:E)*-1)","v":0}]
["BC","BA2760","Accantonamenti per premio di operosità (SUMAI)","C",{"$f":"IF('00 Aggregatore'!$D289=\"R\",SUMIF('00 Alimenta'!$A:$A,$B289,'00 Alimenta'!D:D),SUMIF('00 Alimenta'!$A:$A,$B289,'00 Alimenta'!D:D)*-1)","v":225172.71},{"$f":"IF('00 Aggregatore'!$D289=\"R\",SUMIF('00 Alimenta'!$A:$A,$B289,'00 Alimenta'!E:E),SUMIF('00 Alimenta'!$A:$A,$B289,'00 Alimenta'!E:E)*-1)","v":223015.56}]
["BC","BA2780","Accantonamenti per quote inutilizzate contributi da Regione o Provincia Autonoma per quota F.S. vincolato","C",{"$f":"IF('00 Aggregatore'!$D290=\"R\",SUMIF('00 Alimenta'!$A:$A,$B290,'00 Alimenta'!D:D),SUMIF('00 Alimenta'!$A:$A,$B290,'00 Alimenta'!D:D)*-1)","v":4021566.65},{"$f":"IF('00 Aggregatore'!$D290=\"R\",SUMIF('00 Alimenta'!$A:$A,$B290,'00 Alimenta'!E:E),SUMIF('00 Alimenta'!$A:$A,$B290,'00 Alimenta'!E:E)*-1)","v":7018127.5499999998}]
["BC","BA2790","Accantonamenti per quote inutilizzate contributi da soggetti pubblici (extra fondo) vincolati","C",{"$f":"IF('00 Aggregatore'!$D291=\"R\",SUMIF('00 Alimenta'!$A:$A,$B291,'00 Alimenta'!D:D),SUMIF('00 Alimenta'!$A:$A,$B291,'00 Alimenta'!D:D)*-1)","v":180605.96},{"$f":"IF('00 Aggregatore'!$D291=\"R\",SUMIF('00 Alimenta'!$A:$A,$B291,'00 Alimenta'!E:E),SUMIF('00 Alimenta'!$A:$A,$B291,'00 Alimenta'!E:E)*-1)","v":50302.400000000001}]
["BC","BA2800","Accantonamenti per quote inutilizzate contributi da soggetti pubblici per ricerca","C",{"$f":"IF('00 Aggregatore'!$D292=\"R\",SUMIF('00 Alimenta'!$A:$A,$B292,'00 Alimenta'!D:D),SUMIF('00 Alimenta'!$A:$A,$B292,'00 Alimenta'!D:D)*-1)","v":0},{"$f":"IF('00 Aggregatore'!$D292=\"R\",SUMIF('00 Alimenta'!$A:$A,$B292,'00 Alimenta'!E:E),SUMIF('00 Alimenta'!$A:$A,$B292,'00 Alimenta'!E:E)*-1)","v":0}]
["BC","BA2810","Accantonamenti per quote inutilizzate contributi vincolati da privati","C",{"$f":"IF('00 Aggregatore'!$D293=\"R\",SUMIF('00 Alimenta'!$A:$A,$B293,'00 Alimenta'!D:D),SUMIF('00 Alimenta'!$A:$A,$B293,'00 Alimenta'!D:D)*-1)","v":0},{"$f":"IF('00 Aggregatore'!$D293=\"R\",SUMIF('00 Alimenta'!$A:$A,$B293,'00 Alimenta'!E:E),SUMIF('00 Alimenta'!$A:$A,$B293,'00 Alimenta'!E:E)*-1)","v":0}]
["BC","BA2830","Accantonamenti per interessi di mora","C",{"$f":"IF('00 Aggregatore'!$D294=\"R\",SUMIF('00 Alimenta'!$A:$A,$B294,'00 Alimenta'!D:D),SUMIF('00 Alimenta'!$A:$A,$B294,'00 Alimenta'!D:D)*-1)","v":0},{"$f":"IF('00 Aggregatore'!$D294=\"R\",SUMIF('00 Alimenta'!$A:$A,$B294,'00 Alimenta'!E:E),SUMIF('00 Alimenta'!$A:$A,$B294,'00 Alimenta'!E:E)*-1)","v":0}]
["BC","BA2840","Accantonamenti per rinnovi convenzioni MMG/PLS/MCA","C",{"$f":"IF('00 Aggregatore'!$D295=\"R\",SUMIF('00 Alimenta'!$A:$A,$B295,'00 Alimenta'!D:D),SUMIF('00 Alimenta'!$A:$A,$B295,'00 Alimenta'!D:D)*-1)","v":407348},{"$f":"IF('00 Aggregatore'!$D295=\"R\",SUMIF('00 Alimenta'!$A:$A,$B295,'00 Alimenta'!E:E),SUMIF('00 Alimenta'!$A:$A,$B295,'00 Alimenta'!E:E)*-1)","v":653733}]
["BC","BA2850","Accantonamenti per rinnovi convenzioni Medici Sumai","C",{"$f":"IF('00 Aggregatore'!$D296=\"R\",SUMIF('00 Alimenta'!$A:$A,$B296,'00 Alimenta'!D:D),SUMIF('00 Alimenta'!$A:$A,$B296,'00 Alimenta'!D:D)*-1)","v":48849},{"$f":"IF('00 Aggregatore'!$D296=\"R\",SUMIF('00 Alimenta'!$A:$A,$B296,'00 Alimenta'!E:E),SUMIF('00 Alimenta'!$A:$A,$B296,'00 Alimenta'!E:E)*-1)","v":82934}]
["BC","BA2860","Accantonamenti per rinnovi contrattuali: dirigenza medica","C",{"$f":"IF('00 Aggregatore'!$D297=\"R\",SUMIF('00 Alimenta'!$A:$A,$B297,'00 Alimenta'!D:D),SUMIF('00 Alimenta'!$A:$A,$B297,'00 Alimenta'!D:D)*-1)","v":278091},{"$f":"IF('00 Aggregatore'!$D297=\"R\",SUMIF('00 Alimenta'!$A:$A,$B297,'00 Alimenta'!E:E),SUMIF('00 Alimenta'!$A:$A,$B297,'00 Alimenta'!E:E)*-1)","v":757797}]
["BC","BA2870","Accantonamenti per rinnovi contrattuali: dirigenza non medica","C",{"$f":"IF('00 Aggregatore'!$D298=\"R\",SUMIF('00 Alimenta'!$A:$A,$B298,'00 Alimenta'!D:D),SUMIF('00 Alimenta'!$A:$A,$B298,'00 Alimenta'!D:D)*-1)","v":27505},{"$f":"IF('00 Aggregatore'!$D298=\"R\",SUMIF('00 Alimenta'!$A:$A,$B298,'00 Alimenta'!E:E),SUMIF('00 Alimenta'!$A:$A,$B298,'00 Alimenta'!E:E)*-1)","v":74949}]
["BC","BA2880","Accantonamenti per rinnovi contrattuali: comparto","C",{"$f":"IF('00 Aggregatore'!$D299=\"R\",SUMIF('00 Alimenta'!$A:$A,$B299,'00 Alimenta'!D:D),SUMIF('00 Alimenta'!$A:$A,$B299,'00 Alimenta'!D:D)*-1)","v":370028},{"$f":"IF('00 Aggregatore'!$D299=\"R\",SUMIF('00 Alimenta'!$A:$A,$B299,'00 Alimenta'!E:E),SUMIF('00 Alimenta'!$A:$A,$B299,'00 Alimenta'!E:E)*-1)","v":1008327}]
["BC","BA2890","Altri accantonamenti","C",{"$f":"IF('00 Aggregatore'!$D300=\"R\",SUMIF('00 Alimenta'!$A:$A,$B300,'00 Alimenta'!D:D),SUMIF('00 Alimenta'!$A:$A,$B300,'00 Alimenta'!D:D)*-1)","v":0},{"$f":"IF('00 Aggregatore'!$D300=\"R\",SUMIF('00 Alimenta'!$A:$A,$B300,'00 Alimenta'!E:E),SUMIF('00 Alimenta'!$A:$A,$B300,'00 Alimenta'!E:E)*-1)","v":300000}]
["CR","CA0020","Interessi attivi su c/tesoreria unica","R",{"$f":"IF('00 Aggregatore'!$D301=\"R\",SUMIF('00 Alimenta'!$A:$A,$B301,'00 Alimenta'!D:D),SUMIF('00 Alimenta'!$A:$A,$B301,'00 Alimenta'!D:D)*-1)","v":0},{"$f":"IF('00 Aggregatore'!$D301=\"R\",SUMIF('00 Alimenta'!$A:$A,$B301,'00 Alimenta'!E:E),SUMIF('00 Alimenta'!$A:$A,$B301,'00 Alimenta'!E:E)*-1)","v":0}]
["CR","CA0030","Interessi attivi su c/c postali e bancari","R",{"$f":"IF('00 Aggregatore'!$D302=\"R\",SUMIF('00 Alimenta'!$A:$A,$B302,'00 Alimenta'!D:D),SUMIF('00 Alimenta'!$A:$A,$B302,'00 Alimenta'!D:D)*-1)","v":14.16},{"$f":"IF('00 Aggregatore'!$D302=\"R\",SUMIF('00 Alimenta'!$A:$A,$B302,'00 Alimenta'!E:E),SUMIF('00 Alimenta'!$A:$A,$B302,'00 Alimenta'!E:E)*-1)","v":0}]
["CR","CA0040","Altri interessi attivi","R",{"$f":"IF('00 Aggregatore'!$D303=\"R\",SUMIF('00 Alimenta'!$A:$A,$B303,'00 Alimenta'!D:D),SUMIF('00 Alimenta'!$A:$A,$B303,'00 Alimenta'!D:D)*-1)","v":0},{"$f":"IF('00 Aggregatore'!$D303=\"R\",SUMIF('00 Alimenta'!$A:$A,$B303,'00 Alimenta'!E:E),SUMIF('00 Alimenta'!$A:$A,$B303,'00 Alimenta'!E:E)*-1)","v":0}]
["CR","CA0060","Proventi da partecipazioni","R",{"$f":"IF('00 Aggregatore'!$D304=\"R\",SUMIF('00 Alimenta'!$A:$A,$B304,'00 Alimenta'!D:D),SUMIF('00 Alimenta'!$A:$A,$B304,'00 Alimenta'!D:D)*-1)","v":0},{"$f":"IF('00 Aggregatore'!$D304=\"R\",SUMIF('00 Alimenta'!$A:$A,$B304,'00 Alimenta'!E:E),SUMIF('00 Alimenta'!$A:$A,$B304,'00 Alimenta'!E:E)*-1)","v":0}]
["CR","CA0070","Proventi finanziari da crediti iscritti nelle immobilizzazioni","R",{"$f":"IF('00 Aggregatore'!$D305=\"R\",SUMIF('00 Alimenta'!$A:$A,$B305,'00 Alimenta'!D:D),SUMIF('00 Alimenta'!$A:$A,$B305,'00 Alimenta'!D:D)*-1)","v":0},{"$f":"IF('00 Aggregatore'!$D305=\"R\",SUMIF('00 Alimenta'!$A:$A,$B305,'00 Alimenta'!E:E),SUMIF('00 Alimenta'!$A:$A,$B305,'00 Alimenta'!E:E)*-1)","v":0}]
["CR","CA0080","Proventi finanziari da titoli iscritti nelle immobilizzazioni","R",{"$f":"IF('00 Aggregatore'!$D306=\"R\",SUMIF('00 Alimenta'!$A:$A,$B306,'00 Alimenta'!D:D),SUMIF('00 Alimenta'!$A:$A,$B306,'00 Alimenta'!D:D)*-1)","v":0},{"$f":"IF('00 Aggregatore'!$D306=\"R\",SUMIF('00 Alimenta'!$A:$A,$B306,'00 Alimenta'!E:E),SUMIF('00 Alimenta'!$A:$A,$B306,'00 Alimenta'!E:E)*-1)","v":0}]
["CR","CA0090","Altri proventi finanziari diversi dai precedenti","R",{"$f":"IF('00 Aggregatore'!$D307=\"R\",SUMIF('00 Alimenta'!$A:$A,$B307,'00 Alimenta'!D:D),SUMIF('00 Alimenta'!$A:$A,$B307,'00 Alimenta'!D:D)*-1)","v":0},{"$f":"IF('00 Aggregatore'!$D307=\"R\",SUMIF('00 Alimenta'!$A:$A,$B307,'00 Alimenta'!E:E),SUMIF('00 Alimenta'!$A:$A,$B307,'00 Alimenta'!E:E)*-1)","v":0}]
["CR","CA0100","Utili su cambi","R",{"$f":"IF('00 Aggregatore'!$D308=\"R\",SUMIF('00 Alimenta'!$A:$A,$B308,'00 Alimenta'!D:D),SUMIF('00 Alimenta'!$A:$A,$B308,'00 Alimenta'!D:D)*-1)","v":0},{"$f":"IF('00 Aggregatore'!$D308=\"R\",SUMIF('00 Alimenta'!$A:$A,$B308,'00 Alimenta'!E:E),SUMIF('00 Alimenta'!$A:$A,$B308,'00 Alimenta'!E:E)*-1)","v":0}]
["CC","CA0120","Interessi passivi su anticipazioni di cassa","C",{"$f":"IF('00 Aggregatore'!$D309=\"R\",SUMIF('00 Alimenta'!$A:$A,$B309,'00 Alimenta'!D:D),SUMIF('00 Alimenta'!$A:$A,$B309,'00 Alimenta'!D:D)*-1)","v":0},{"$f":"IF('00 Aggregatore'!$D309=\"R\",SUMIF('00 Alimenta'!$A:$A,$B309,'00 Alimenta'!E:E),SUMIF('00 Alimenta'!$A:$A,$B309,'00 Alimenta'!E:E)*-1)","v":0}]
["CC","CA0130","Interessi passivi su mutui","C",{"$f":"IF('00 Aggregatore'!$D310=\"R\",SUMIF('00 Alimenta'!$A:$A,$B310,'00 Alimenta'!D:D),SUMIF('00 Alimenta'!$A:$A,$B310,'00 Alimenta'!D:D)*-1)","v":0},{"$f":"IF('00 Aggregatore'!$D310=\"R\",SUMIF('00 Alimenta'!$A:$A,$B310,'00 Alimenta'!E:E),SUMIF('00 Alimenta'!$A:$A,$B310,'00 Alimenta'!E:E)*-1)","v":0}]
["CC","CA0140","Altri interessi passivi","C",{"$f":"IF('00 Aggregatore'!$D311=\"R\",SUMIF('00 Alimenta'!$A:$A,$B311,'00 Alimenta'!D:D),SUMIF('00 Alimenta'!$A:$A,$B311,'00 Alimenta'!D:D)*-1)","v":25986.100000000002},{"$f":"IF('00 Aggregatore'!$D311=\"R\",SUMIF('00 Alimenta'!$A:$A,$B311,'00 Alimenta'!E:E),SUMIF('00 Alimenta'!$A:$A,$B311,'00 Alimenta'!E:E)*-1)","v":157826.75}]
["CC","CA0160","Altri oneri finanziari","C",{"$f":"IF('00 Aggregatore'!$D312=\"R\",SUMIF('00 Alimenta'!$A:$A,$B312,'00 Alimenta'!D:D),SUMIF('00 Alimenta'!$A:$A,$B312,'00 Alimenta'!D:D)*-1)","v":167.46},{"$f":"IF('00 Aggregatore'!$D312=\"R\",SUMIF('00 Alimenta'!$A:$A,$B312,'00 Alimenta'!E:E),SUMIF('00 Alimenta'!$A:$A,$B312,'00 Alimenta'!E:E)*-1)","v":4522.33}]
["CC","CA0170","Perdite su cambi","C",{"$f":"IF('00 Aggregatore'!$D313=\"R\",SUMIF('00 Alimenta'!$A:$A,$B313,'00 Alimenta'!D:D),SUMIF('00 Alimenta'!$A:$A,$B313,'00 Alimenta'!D:D)*-1)","v":0},{"$f":"IF('00 Aggregatore'!$D313=\"R\",SUMIF('00 Alimenta'!$A:$A,$B313,'00 Alimenta'!E:E),SUMIF('00 Alimenta'!$A:$A,$B313,'00 Alimenta'!E:E)*-1)","v":0}]
["DR","DA0010","Rivalutazioni","R",{"$f":"IF('00 Aggregatore'!$D314=\"R\",SUMIF('00 Alimenta'!$A:$A,$B314,'00 Alimenta'!D:D),SUMIF('00 Alimenta'!$A:$A,$B314,'00 Alimenta'!D:D)*-1)","v":0},{"$f":"IF('00 Aggregatore'!$D314=\"R\",SUMIF('00 Alimenta'!$A:$A,$B314,'00 Alimenta'!E:E),SUMIF('00 Alimenta'!$A:$A,$B314,'00 Alimenta'!E:E)*-1)","v":0}]
["DC","DA0020","Svalutazioni","C",{"$f":"IF('00 Aggregatore'!$D315=\"R\",SUMIF('00 Alimenta'!$A:$A,$B315,'00 Alimenta'!D:D),SUMIF('00 Alimenta'!$A:$A,$B315,'00 Alimenta'!D:D)*-1)","v":0},{"$f":"IF('00 Aggregatore'!$D315=\"R\",SUMIF('00 Alimenta'!$A:$A,$B315,'00 Alimenta'!E:E),SUMIF('00 Alimenta'!$A:$A,$B315,'00 Alimenta'!E:E)*-1)","v":0}]
["ER","EA0020","Plusvalenze","R",{"$f":"IF('00 Aggregatore'!$D316=\"R\",SUMIF('00 Alimenta'!$A:$A,$B316,'00 Alimenta'!D:D),SUMIF('00 Alimenta'!$A:$A,$B316,'00 Alimenta'!D:D)*-1)","v":0},{"$f":"IF('00 Aggregatore'!$D316=\"R\",SUMIF('00 Alimenta'!$A:$A,$B316,'00 Alimenta'!E:E),SUMIF('00 Alimenta'!$A:$A,$B316,'00 Alimenta'!E:E)*-1)","v":0}]
["ER","EA0040","Proventi da donazioni e liberalità diverse","R",{"$f":"IF('00 Aggregatore'!$D317=\"R\",SUMIF('00 Alimenta'!$A:$A,$B317,'00 Alimenta'!D:D),SUMIF('00 Alimenta'!$A:$A,$B317,'00 Alimenta'!D:D)*-1)","v":0},{"$f":"IF('00 Aggregatore'!$D317=\"R\",SUMIF('00 Alimenta'!$A:$A,$B317,'00 Alimenta'!E:E),SUMIF('00 Alimenta'!$A:$A,$B317,'00 Alimenta'!E:E)*-1)","v":0}]
["ER","EA0060","Sopravvenienze attive v/Aziende sanitarie pubbliche della Regione","R",{"$f":"IF('00 Aggregatore'!$D318=\"R\",SUMIF('00 Alimenta'!$A:$A,$B318,'00 Alimenta'!D:D),SUMIF('00 Alimenta'!$A:$A,$B318,'00 Alimenta'!D:D)*-1)","v":123928.70000000001},{"$f":"IF('00 Aggregatore'!$D318=\"R\",SUMIF('00 Alimenta'!$A:$A,$B318,'00 Alimenta'!E:E),SUMIF('00 Alimenta'!$A:$A,$B318,'00 Alimenta'!E:E)*-1)","v":2049452.26}]
["ER","EA0080","Sopravvenienze attive v/terzi relative alla mobilità extraregionale","R",{"$f":"IF('00 Aggregatore'!$D319=\"R\",SUMIF('00 Alimenta'!$A:$A,$B319,'00 Alimenta'!D:D),SUMIF('00 Alimenta'!$A:$A,$B319,'00 Alimenta'!D:D)*-1)","v":0},{"$f":"IF('00 Aggregatore'!$D319=\"R\",SUMIF('00 Alimenta'!$A:$A,$B319,'00 Alimenta'!E:E),SUMIF('00 Alimenta'!$A:$A,$B319,'00 Alimenta'!E:E)*-1)","v":0}]
["ER","EA0090","Sopravvenienze attive v/terzi relative al personale","R",{"$f":"IF('00 Aggregatore'!$D320=\"R\",SUMIF('00 Alimenta'!$A:$A,$B320,'00 Alimenta'!D:D),SUMIF('00 Alimenta'!$A:$A,$B320,'00 Alimenta'!D:D)*-1)","v":0},{"$f":"IF('00 Aggregatore'!$D320=\"R\",SUMIF('00 Alimenta'!$A:$A,$B320,'00 Alimenta'!E:E),SUMIF('00 Alimenta'!$A:$A,$B320,'00 Alimenta'!E:E)*-1)","v":0}]
["ER","EA0100","Sopravvenienze attive v/terzi relative alle convenzioni con medici di base","R",{"$f":"IF('00 Aggregatore'!$D321=\"R\",SUMIF('00 Alimenta'!$A:$A,$B321,'00 Alimenta'!D:D),SUMIF('00 Alimenta'!$A:$A,$B321,'00 Alimenta'!D:D)*-1)","v":0},{"$f":"IF('00 Aggregatore'!$D321=\"R\",SUMIF('00 Alimenta'!$A:$A,$B321,'00 Alimenta'!E:E),SUMIF('00 Alimenta'!$A:$A,$B321,'00 Alimenta'!E:E)*-1)","v":0}]
["ER","EA0110","Sopravvenienze attive v/terzi relative alle convenzioni per la specialistica","R",{"$f":"IF('00 Aggregatore'!$D322=\"R\",SUMIF('00 Alimenta'!$A:$A,$B322,'00 Alimenta'!D:D),SUMIF('00 Alimenta'!$A:$A,$B322,'00 Alimenta'!D:D)*-1)","v":0},{"$f":"IF('00 Aggregatore'!$D322=\"R\",SUMIF('00 Alimenta'!$A:$A,$B322,'00 Alimenta'!E:E),SUMIF('00 Alimenta'!$A:$A,$B322,'00 Alimenta'!E:E)*-1)","v":0}]
["ER","EA0120","Sopravvenienze attive v/terzi relative all'acquisto di prestazioni sanitarie da operatori accreditati","R",{"$f":"IF('00 Aggregatore'!$D323=\"R\",SUMIF('00 Alimenta'!$A:$A,$B323,'00 Alimenta'!D:D),SUMIF('00 Alimenta'!$A:$A,$B323,'00 Alimenta'!D:D)*-1)","v":284856.88},{"$f":"IF('00 Aggregatore'!$D323=\"R\",SUMIF('00 Alimenta'!$A:$A,$B323,'00 Alimenta'!E:E),SUMIF('00 Alimenta'!$A:$A,$B323,'00 Alimenta'!E:E)*-1)","v":2999852.73}]
["ER","EA0130","Sopravvenienze attive v/terzi relative all'acquisto di beni e servizi","R",{"$f":"IF('00 Aggregatore'!$D324=\"R\",SUMIF('00 Alimenta'!$A:$A,$B324,'00 Alimenta'!D:D),SUMIF('00 Alimenta'!$A:$A,$B324,'00 Alimenta'!D:D)*-1)","v":302481.96999999997},{"$f":"IF('00 Aggregatore'!$D324=\"R\",SUMIF('00 Alimenta'!$A:$A,$B324,'00 Alimenta'!E:E),SUMIF('00 Alimenta'!$A:$A,$B324,'00 Alimenta'!E:E)*-1)","v":341295.78}]
["ER","EA0140","Altre sopravvenienze attive v/terzi","R",{"$f":"IF('00 Aggregatore'!$D325=\"R\",SUMIF('00 Alimenta'!$A:$A,$B325,'00 Alimenta'!D:D),SUMIF('00 Alimenta'!$A:$A,$B325,'00 Alimenta'!D:D)*-1)","v":4037904.54},{"$f":"IF('00 Aggregatore'!$D325=\"R\",SUMIF('00 Alimenta'!$A:$A,$B325,'00 Alimenta'!E:E),SUMIF('00 Alimenta'!$A:$A,$B325,'00 Alimenta'!E:E)*-1)","v":2010658.93}]
[{"$f":"LEFT(B326,1)&D326","v":"ER"},"EA0160","Insussistenze attive v/Aziende sanitarie pubbliche della Regione","R",{"$f":"IF('00 Aggregatore'!$D326=\"R\",SUMIF('00 Alimenta'!$A:$A,$B326,'00 Alimenta'!D:D),SUMIF('00 Alimenta'!$A:$A,$B326,'00 Alimenta'!D:D)*-1)","v":0},{"$f":"IF('00 Aggregatore'!$D326=\"R\",SUMIF('00 Alimenta'!$A:$A,$B326,'00 Alimenta'!E:E),SUMIF('00 Alimenta'!$A:$A,$B326,'00 Alimenta'!E:E)*-1)","v":0}]
["ER","EA0180","Insussistenze attive v/terzi relative alla mobilità extraregionale","R",{"$f":"IF('00 Aggregatore'!$D327=\"R\",SUMIF('00 Alimenta'!$A:$A,$B327,'00 Alimenta'!D:D),SUMIF('00 Alimenta'!$A:$A,$B327,'00 Alimenta'!D:D)*-1)","v":0},{"$f":"IF('00 Aggregatore'!$D327=\"R\",SUMIF('00 Alimenta'!$A:$A,$B327,'00 Alimenta'!E:E),SUMIF('00 Alimenta'!$A:$A,$B327,'00 Alimenta'!E:E)*-1)","v":0}]
["ER","EA0190","Insussistenze attive v/terzi relative al personale","R",{"$f":"IF('00 Aggregatore'!$D328=\"R\",SUMIF('00 Alimenta'!$A:$A,$B328,'00 Alimenta'!D:D),SUMIF('00 Alimenta'!$A:$A,$B328,'00 Alimenta'!D:D)*-1)","v":0},{"$f":"IF('00 Aggregatore'!$D328=\"R\",SUMIF('00 Alimenta'!$A:$A,$B328,'00 Alimenta'!E:E),SUMIF('00 Alimenta'!$A:$A,$B328,'00 Alimenta'!E:E)*-1)","v":0}]
["ER","EA0200","Insussistenze attive v/terzi relative alle convenzioni con medici di base","R",{"$f":"IF('00 Aggregatore'!$D329=\"R\",SUMIF('00 Alimenta'!$A:$A,$B329,'00 Alimenta'!D:D),SUMIF('00 Alimenta'!$A:$A,$B329,'00 Alimenta'!D:D)*-1)","v":0},{"$f":"IF('00 Aggregatore'!$D329=\"R\",SUMIF('00 Alimenta'!$A:$A,$B329,'00 Alimenta'!E:E),SUMIF('00 Alimenta'!$A:$A,$B329,'00 Alimenta'!E:E)*-1)","v":0}]
["ER","EA0210","Insussistenze attive v/terzi relative alle convenzioni per la specialistica","R",{"$f":"IF('00 Aggregatore'!$D330=\"R\",SUMIF('00 Alimenta'!$A:$A,$B330,'00 Alimenta'!D:D),SUMIF('00 Alimenta'!$A:$A,$B330,'00 Alimenta'!D:D)*-1)","v":0},{"$f":"IF('00 Aggregatore'!$D330=\"R\",SUMIF('00 Alimenta'!$A:$A,$B330,'00 Alimenta'!E:E),SUMIF('00 Alimenta'!$A:$A,$B330,'00 Alimenta'!E:E)*-1)","v":0}]
["ER","EA0220","Insussistenze attive v/terzi relative all'acquisto di prestazioni sanitarie da operatori accreditati","R",{"$f":"IF('00 Aggregatore'!$D331=\"R\",SUMIF('00 Alimenta'!$A:$A,$B331,'00 Alimenta'!D:D),SUMIF('00 Alimenta'!$A:$A,$B331,'00 Alimenta'!D:D)*-1)","v":0},{"$f":"IF('00 Aggregatore'!$D331=\"R\",SUMIF('00 Alimenta'!$A:$A,$B331,'00 Alimenta'!E:E),SUMIF('00 Alimenta'!$A:$A,$B331,'00 Alimenta'!E:E)*-1)","v":1672403.91}]
["ER","EA0230","Insussistenze attive v/terzi relative all'acquisto di beni e servizi","R",{"$f":"IF('00 Aggregatore'!$D332=\"R\",SUMIF('00 Alimenta'!$A:$A,$B332,'00 Alimenta'!D:D),SUMIF('00 Alimenta'!$A:$A,$B332,'00 Alimenta'!D:D)*-1)","v":92652.33},{"$f":"IF('00 Aggregatore'!$D332=\"R\",SUMIF('00 Alimenta'!$A:$A,$B332,'00 Alimenta'!E:E),SUMIF('00 Alimenta'!$A:$A,$B332,'00 Alimenta'!E:E)*-1)","v":288245.17}]
["ER","EA0240","Altre insussistenze attive v/terzi","R",{"$f":"IF('00 Aggregatore'!$D333=\"R\",SUMIF('00 Alimenta'!$A:$A,$B333,'00 Alimenta'!D:D),SUMIF('00 Alimenta'!$A:$A,$B333,'00 Alimenta'!D:D)*-1)","v":205829.59},{"$f":"IF('00 Aggregatore'!$D333=\"R\",SUMIF('00 Alimenta'!$A:$A,$B333,'00 Alimenta'!E:E),SUMIF('00 Alimenta'!$A:$A,$B333,'00 Alimenta'!E:E)*-1)","v":125240.07}]
["ER","EA0250","Altri proventi straordinari","R",{"$f":"IF('00 Aggregatore'!$D334=\"R\",SUMIF('00 Alimenta'!$A:$A,$B334,'00 Alimenta'!D:D),SUMIF('00 Alimenta'!$A:$A,$B334,'00 Alimenta'!D:D)*-1)","v":0},{"$f":"IF('00 Aggregatore'!$D334=\"R\",SUMIF('00 Alimenta'!$A:$A,$B334,'00 Alimenta'!E:E),SUMIF('00 Alimenta'!$A:$A,$B334,'00 Alimenta'!E:E)*-1)","v":0}]
["EC","EA0270","Minusvalenze","C",{"$f":"IF('00 Aggregatore'!$D335=\"R\",SUMIF('00 Alimenta'!$A:$A,$B335,'00 Alimenta'!D:D),SUMIF('00 Alimenta'!$A:$A,$B335,'00 Alimenta'!D:D)*-1)","v":2495.9},{"$f":"IF('00 Aggregatore'!$D335=\"R\",SUMIF('00 Alimenta'!$A:$A,$B335,'00 Alimenta'!E:E),SUMIF('00 Alimenta'!$A:$A,$B335,'00 Alimenta'!E:E)*-1)","v":0}]
["EC","EA0290","Oneri tributari da esercizi precedenti","C",{"$f":"IF('00 Aggregatore'!$D336=\"R\",SUMIF('00 Alimenta'!$A:$A,$B336,'00 Alimenta'!D:D),SUMIF('00 Alimenta'!$A:$A,$B336,'00 Alimenta'!D:D)*-1)","v":0},{"$f":"IF('00 Aggregatore'!$D336=\"R\",SUMIF('00 Alimenta'!$A:$A,$B336,'00 Alimenta'!E:E),SUMIF('00 Alimenta'!$A:$A,$B336,'00 Alimenta'!E:E)*-1)","v":0}]
["EC","EA0300","Oneri da cause civili e oneri processuali","C",{"$f":"IF('00 Aggregatore'!$D337=\"R\",SUMIF('00 Alimenta'!$A:$A,$B337,'00 Alimenta'!D:D),SUMIF('00 Alimenta'!$A:$A,$B337,'00 Alimenta'!D:D)*-1)","v":0},{"$f":"IF('00 Aggregatore'!$D337=\"R\",SUMIF('00 Alimenta'!$A:$A,$B337,'00 Alimenta'!E:E),SUMIF('00 Alimenta'!$A:$A,$B337,'00 Alimenta'!E:E)*-1)","v":0}]
["EC","EA0330","Sopravvenienze passive v/Aziende sanitarie pubbliche relative alla mobilità intraregionale","C",{"$f":"IF('00 Aggregatore'!$D338=\"R\",SUMIF('00 Alimenta'!$A:$A,$B338,'00 Alimenta'!D:D),SUMIF('00 Alimenta'!$A:$A,$B338,'00 Alimenta'!D:D)*-1)","v":82615.08},{"$f":"IF('00 Aggregatore'!$D338=\"R\",SUMIF('00 Alimenta'!$A:$A,$B338,'00 Alimenta'!E:E),SUMIF('00 Alimenta'!$A:$A,$B338,'00 Alimenta'!E:E)*-1)","v":0}]
["EC","EA0340","Altre sopravvenienze passive v/Aziende sanitarie pubbliche della Regione","C",{"$f":"IF('00 Aggregatore'!$D339=\"R\",SUMIF('00 Alimenta'!$A:$A,$B339,'00 Alimenta'!D:D),SUMIF('00 Alimenta'!$A:$A,$B339,'00 Alimenta'!D:D)*-1)","v":88812.51},{"$f":"IF('00 Aggregatore'!$D339=\"R\",SUMIF('00 Alimenta'!$A:$A,$B339,'00 Alimenta'!E:E),SUMIF('00 Alimenta'!$A:$A,$B339,'00 Alimenta'!E:E)*-1)","v":134078.51}]
["EC","EA0360","Sopravvenienze passive v/terzi relative alla mobilità extraregionale","C",{"$f":"IF('00 Aggregatore'!$D340=\"R\",SUMIF('00 Alimenta'!$A:$A,$B340,'00 Alimenta'!D:D),SUMIF('00 Alimenta'!$A:$A,$B340,'00 Alimenta'!D:D)*-1)","v":0},{"$f":"IF('00 Aggregatore'!$D340=\"R\",SUMIF('00 Alimenta'!$A:$A,$B340,'00 Alimenta'!E:E),SUMIF('00 Alimenta'!$A:$A,$B340,'00 Alimenta'!E:E)*-1)","v":0}]
["EC","EA0380","Sopravvenienze passive v/terzi relative al personale - dirigenza medica","C",{"$f":"IF('00 Aggregatore'!$D341=\"R\",SUMIF('00 Alimenta'!$A:$A,$B341,'00 Alimenta'!D:D),SUMIF('00 Alimenta'!$A:$A,$B341,'00 Alimenta'!D:D)*-1)","v":432547.66},{"$f":"IF('00 Aggregatore'!$D341=\"R\",SUMIF('00 Alimenta'!$A:$A,$B341,'00 Alimenta'!E:E),SUMIF('00 Alimenta'!$A:$A,$B341,'00 Alimenta'!E:E)*-1)","v":183240.74}]
["EC","EA0390","Sopravvenienze passive v/terzi relative al personale - dirigenza non medica","C",{"$f":"IF('00 Aggregatore'!$D342=\"R\",SUMIF('00 Alimenta'!$A:$A,$B342,'00 Alimenta'!D:D),SUMIF('00 Alimenta'!$A:$A,$B342,'00 Alimenta'!D:D)*-1)","v":24961.1},{"$f":"IF('00 Aggregatore'!$D342=\"R\",SUMIF('00 Alimenta'!$A:$A,$B342,'00 Alimenta'!E:E),SUMIF('00 Alimenta'!$A:$A,$B342,'00 Alimenta'!E:E)*-1)","v":5333.38}]
["EC","EA0400","Sopravvenienze passive v/terzi relative al personale - Comparto","C",{"$f":"IF('00 Aggregatore'!$D343=\"R\",SUMIF('00 Alimenta'!$A:$A,$B343,'00 Alimenta'!D:D),SUMIF('00 Alimenta'!$A:$A,$B343,'00 Alimenta'!D:D)*-1)","v":407333.8},{"$f":"IF('00 Aggregatore'!$D343=\"R\",SUMIF('00 Alimenta'!$A:$A,$B343,'00 Alimenta'!E:E),SUMIF('00 Alimenta'!$A:$A,$B343,'00 Alimenta'!E:E)*-1)","v":363166.05}]
["EC","EA0410","Sopravvenienze passive v/terzi relative alle convenzioni con medici di base","C",{"$f":"IF('00 Aggregatore'!$D344=\"R\",SUMIF('00 Alimenta'!$A:$A,$B344,'00 Alimenta'!D:D),SUMIF('00 Alimenta'!$A:$A,$B344,'00 Alimenta'!D:D)*-1)","v":90919.59},{"$f":"IF('00 Aggregatore'!$D344=\"R\",SUMIF('00 Alimenta'!$A:$A,$B344,'00 Alimenta'!E:E),SUMIF('00 Alimenta'!$A:$A,$B344,'00 Alimenta'!E:E)*-1)","v":0}]
["EC","EA0420","Sopravvenienze passive v/terzi relative alle convenzioni per la specialistica","C",{"$f":"IF('00 Aggregatore'!$D345=\"R\",SUMIF('00 Alimenta'!$A:$A,$B345,'00 Alimenta'!D:D),SUMIF('00 Alimenta'!$A:$A,$B345,'00 Alimenta'!D:D)*-1)","v":0},{"$f":"IF('00 Aggregatore'!$D345=\"R\",SUMIF('00 Alimenta'!$A:$A,$B345,'00 Alimenta'!E:E),SUMIF('00 Alimenta'!$A:$A,$B345,'00 Alimenta'!E:E)*-1)","v":48576.12}]
["EC","EA0430","Sopravvenienze passive v/terzi relative all'acquisto di prestazioni sanitarie da operatori accreditati","C",{"$f":"IF('00 Aggregatore'!$D346=\"R\",SUMIF('00 Alimenta'!$A:$A,$B346,'00 Alimenta'!D:D),SUMIF('00 Alimenta'!$A:$A,$B346,'00 Alimenta'!D:D)*-1)","v":1108945.43},{"$f":"IF('00 Aggregatore'!$D346=\"R\",SUMIF('00 Alimenta'!$A:$A,$B346,'00 Alimenta'!E:E),SUMIF('00 Alimenta'!$A:$A,$B346,'00 Alimenta'!E:E)*-1)","v":25282.29}]
["EC","EA0440","Sopravvenienze passive v/terzi relative all'acquisto di beni e servizi","C",{"$f":"IF('00 Aggregatore'!$D347=\"R\",SUMIF('00 Alimenta'!$A:$A,$B347,'00 Alimenta'!D:D),SUMIF('00 Alimenta'!$A:$A,$B347,'00 Alimenta'!D:D)*-1)","v":964208.68},{"$f":"IF('00 Aggregatore'!$D347=\"R\",SUMIF('00 Alimenta'!$A:$A,$B347,'00 Alimenta'!E:E),SUMIF('00 Alimenta'!$A:$A,$B347,'00 Alimenta'!E:E)*-1)","v":2651265.85}]
["EC","EA0450","Altre sopravvenienze passive v/terzi","C",{"$f":"IF('00 Aggregatore'!$D348=\"R\",SUMIF('00 Alimenta'!$A:$A,$B348,'00 Alimenta'!D:D),SUMIF('00 Alimenta'!$A:$A,$B348,'00 Alimenta'!D:D)*-1)","v":115599.81},{"$f":"IF('00 Aggregatore'!$D348=\"R\",SUMIF('00 Alimenta'!$A:$A,$B348,'00 Alimenta'!E:E),SUMIF('00 Alimenta'!$A:$A,$B348,'00 Alimenta'!E:E)*-1)","v":134394.78}]
["EC","EA0470","Insussistenze passive v/Aziende sanitarie pubbliche della Regione","C",{"$f":"IF('00 Aggregatore'!$D349=\"R\",SUMIF('00 Alimenta'!$A:$A,$B349,'00 Alimenta'!D:D),SUMIF('00 Alimenta'!$A:$A,$B349,'00 Alimenta'!D:D)*-1)","v":0},{"$f":"IF('00 Aggregatore'!$D349=\"R\",SUMIF('00 Alimenta'!$A:$A,$B349,'00 Alimenta'!E:E),SUMIF('00 Alimenta'!$A:$A,$B349,'00 Alimenta'!E:E)*-1)","v":0}]
["EC","EA0490","Insussistenze passive v/terzi relative alla mobilità extraregionale","C",{"$f":"IF('00 Aggregatore'!$D350=\"R\",SUMIF('00 Alimenta'!$A:$A,$B350,'00 Alimenta'!D:D),SUMIF('00 Alimenta'!$A:$A,$B350,'00 Alimenta'!D:D)*-1)","v":0},{"$f":"IF('00 Aggregatore'!$D350=\"R\",SUMIF('00 Alimenta'!$A:$A,$B350,'00 Alimenta'!E:E),SUMIF('00 Alimenta'!$A:$A,$B350,'00 Alimenta'!E:E)*-1)","v":0}]
["EC","EA0500","Insussistenze passive v/terzi relative al personale","C",{"$f":"IF('00 Aggregatore'!$D351=\"R\",SUMIF('00 Alimenta'!$A:$A,$B351,'00 Alimenta'!D:D),SUMIF('00 Alimenta'!$A:$A,$B351,'00 Alimenta'!D:D)*-1)","v":0},{"$f":"IF('00 Aggregatore'!$D351=\"R\",SUMIF('00 Alimenta'!$A:$A,$B351,'00 Alimenta'!E:E),SUMIF('00 Alimenta'!$A:$A,$B351,'00 Alimenta'!E:E)*-1)","v":0}]
["EC","EA0510","Insussistenze passive v/terzi relative alle convenzioni con medici di base","C",{"$f":"IF('00 Aggregatore'!$D352=\"R\",SUMIF('00 Alimenta'!$A:$A,$B352,'00 Alimenta'!D:D),SUMIF('00 Alimenta'!$A:$A,$B352,'00 Alimenta'!D:D)*-1)","v":0},{"$f":"IF('00 Aggregatore'!$D352=\"R\",SUMIF('00 Alimenta'!$A:$A,$B352,'00 Alimenta'!E:E),SUMIF('00 Alimenta'!$A:$A,$B352,'00 Alimenta'!E:E)*-1)","v":0}]
["EC","EA0520","Insussistenze passive v/terzi relative alle convenzioni per la specialistica","C",{"$f":"IF('00 Aggregatore'!$D353=\"R\",SUMIF('00 Alimenta'!$A:$A,$B353,'00 Alimenta'!D:D),SUMIF('00 Alimenta'!$A:$A,$B353,'00 Alimenta'!D:D)*-1)","v":0},{"$f":"IF('00 Aggregatore'!$D353=\"R\",SUMIF('00 Alimenta'!$A:$A,$B353,'00 Alimenta'!E:E),SUMIF('00 Alimenta'!$A:$A,$B353,'00 Alimenta'!E:E)*-1)","v":0}]
["EC","EA0530","Insussistenze passive v/terzi relative all'acquisto di prestazioni sanitarie da operatori accreditati","C",{"$f":"IF('00 Aggregatore'!$D354=\"R\",SUMIF('00 Alimenta'!$A:$A,$B354,'00 Alimenta'!D:D),SUMIF('00 Alimenta'!$A:$A,$B354,'00 Alimenta'!D:D)*-1)","v":91.21},{"$f":"IF('00 Aggregatore'!$D354=\"R\",SUMIF('00 Alimenta'!$A:$A,$B354,'00 Alimenta'!E:E),SUMIF('00 Alimenta'!$A:$A,$B354,'00 Alimenta'!E:E)*-1)","v":832320.62}]
["EC","EA0540","Insussistenze passive v/terzi relative all'acquisto di beni e servizi","C",{"$f":"IF('00 Aggregatore'!$D355=\"R\",SUMIF('00 Alimenta'!$A:$A,$B355,'00 Alimenta'!D:D),SUMIF('00 Alimenta'!$A:$A,$B355,'00 Alimenta'!D:D)*-1)","v":758.66},{"$f":"IF('00 Aggregatore'!$D355=\"R\",SUMIF('00 Alimenta'!$A:$A,$B355,'00 Alimenta'!E:E),SUMIF('00 Alimenta'!$A:$A,$B355,'00 Alimenta'!E:E)*-1)","v":115363.27}]
["EC","EA0550","Altre insussistenze passive v/terzi","C",{"$f":"IF('00 Aggregatore'!$D356=\"R\",SUMIF('00 Alimenta'!$A:$A,$B356,'00 Alimenta'!D:D),SUMIF('00 Alimenta'!$A:$A,$B356,'00 Alimenta'!D:D)*-1)","v":1485001.41},{"$f":"IF('00 Aggregatore'!$D356=\"R\",SUMIF('00 Alimenta'!$A:$A,$B356,'00 Alimenta'!E:E),SUMIF('00 Alimenta'!$A:$A,$B356,'00 Alimenta'!E:E)*-1)","v":76578.070000000007}]
["EC","EA0560","Altri oneri straordinari","C",{"$f":"IF('00 Aggregatore'!$D357=\"R\",SUMIF('00 Alimenta'!$A:$A,$B357,'00 Alimenta'!D:D),SUMIF('00 Alimenta'!$A:$A,$B357,'00 Alimenta'!D:D)*-1)","v":0},{"$f":"IF('00 Aggregatore'!$D357=\"R\",SUMIF('00 Alimenta'!$A:$A,$B357,'00 Alimenta'!E:E),SUMIF('00 Alimenta'!$A:$A,$B357,'00 Alimenta'!E:E)*-1)","v":0}]
["YC","YA0020","IRAP relativa a personale dipendente","C",{"$f":"IF('00 Aggregatore'!$D358=\"R\",SUMIF('00 Alimenta'!$A:$A,$B358,'00 Alimenta'!D:D),SUMIF('00 Alimenta'!$A:$A,$B358,'00 Alimenta'!D:D)*-1)","v":11129085.99},{"$f":"IF('00 Aggregatore'!$D358=\"R\",SUMIF('00 Alimenta'!$A:$A,$B358,'00 Alimenta'!E:E),SUMIF('00 Alimenta'!$A:$A,$B358,'00 Alimenta'!E:E)*-1)","v":10634384.52}]
["YC","YA0030","IRAP relativa a collaboratori e personale assimilato a lavoro dipendente","C",{"$f":"IF('00 Aggregatore'!$D359=\"R\",SUMIF('00 Alimenta'!$A:$A,$B359,'00 Alimenta'!D:D),SUMIF('00 Alimenta'!$A:$A,$B359,'00 Alimenta'!D:D)*-1)","v":513866.32},{"$f":"IF('00 Aggregatore'!$D359=\"R\",SUMIF('00 Alimenta'!$A:$A,$B359,'00 Alimenta'!E:E),SUMIF('00 Alimenta'!$A:$A,$B359,'00 Alimenta'!E:E)*-1)","v":470809.27999999997}]
["YC","YA0040","IRAP relativa ad attività di libera professione (intramoenia)","C",{"$f":"IF('00 Aggregatore'!$D360=\"R\",SUMIF('00 Alimenta'!$A:$A,$B360,'00 Alimenta'!D:D),SUMIF('00 Alimenta'!$A:$A,$B360,'00 Alimenta'!D:D)*-1)","v":481354.25},{"$f":"IF('00 Aggregatore'!$D360=\"R\",SUMIF('00 Alimenta'!$A:$A,$B360,'00 Alimenta'!E:E),SUMIF('00 Alimenta'!$A:$A,$B360,'00 Alimenta'!E:E)*-1)","v":458072.41000000003}]
["YC","YA0050","IRAP relativa ad attività commerciale","C",{"$f":"IF('00 Aggregatore'!$D361=\"R\",SUMIF('00 Alimenta'!$A:$A,$B361,'00 Alimenta'!D:D),SUMIF('00 Alimenta'!$A:$A,$B361,'00 Alimenta'!D:D)*-1)","v":53498.21},{"$f":"IF('00 Aggregatore'!$D361=\"R\",SUMIF('00 Alimenta'!$A:$A,$B361,'00 Alimenta'!E:E),SUMIF('00 Alimenta'!$A:$A,$B361,'00 Alimenta'!E:E)*-1)","v":93278.75}]
["YC","YA0070","IRES su attività istituzionale","C",{"$f":"IF('00 Aggregatore'!$D362=\"R\",SUMIF('00 Alimenta'!$A:$A,$B362,'00 Alimenta'!D:D),SUMIF('00 Alimenta'!$A:$A,$B362,'00 Alimenta'!D:D)*-1)","v":0},{"$f":"IF('00 Aggregatore'!$D362=\"R\",SUMIF('00 Alimenta'!$A:$A,$B362,'00 Alimenta'!E:E),SUMIF('00 Alimenta'!$A:$A,$B362,'00 Alimenta'!E:E)*-1)","v":0}]
["YC","YA0080","IRES su attività commerciale","C",{"$f":"IF('00 Aggregatore'!$D363=\"R\",SUMIF('00 Alimenta'!$A:$A,$B363,'00 Alimenta'!D:D),SUMIF('00 Alimenta'!$A:$A,$B363,'00 Alimenta'!D:D)*-1)","v":426818},{"$f":"IF('00 Aggregatore'!$D363=\"R\",SUMIF('00 Alimenta'!$A:$A,$B363,'00 Alimenta'!E:E),SUMIF('00 Alimenta'!$A:$A,$B363,'00 Alimenta'!E:E)*-1)","v":490066}]
["YC","YA0090","Accantonamento a Fondo Imposte (Accertamenti, condoni, ecc.)","C",{"$f":"IF('00 Aggregatore'!$D364=\"R\",SUMIF('00 Alimenta'!$A:$A,$B364,'00 Alimenta'!D:D),SUMIF('00 Alimenta'!$A:$A,$B364,'00 Alimenta'!D:D)*-1)","v":0},{"$f":"IF('00 Aggregatore'!$D364=\"R\",SUMIF('00 Alimenta'!$A:$A,$B364,'00 Alimenta'!E:E),SUMIF('00 Alimenta'!$A:$A,$B364,'00 Alimenta'!E:E)*-1)","v":0}]
[]
[null,"AR","VALORE DELLA PRODUZIONE - RICAVI",null,{"$f":"SUMIF($A:$A,$B366,E:E)","v":692942542.33999979},706064340.40999997]
[null,"CR","PROVENTI ED ONERI FINAZIARI - RICAVI",null,14.16,0]
[null,"DR","RETTIFICHE DI VALORE ATTIVITA' FINANZIARIE - RICAVI",null,0,0]
[null,"ER","PROVENTI ED ONERI STRAORDINARI -RICAVI",null,5047654.01,9487148.8499999996]
[null,"BC","COSTI DELLA PRODUZIONE - COSTI",null,694819852.90000033,712282553.79999948]
[null,"CC","PROVENTI ED ONERI FINAZIARI - COSTI",null,26153.56,162349.07999999999]
[null,"DC","RETTIFICHE DI VALORE ATTIVITA' FINANZIARIE - COSTI",null,0,0]
[null,"EC","PROVENTI ED ONERI STRAORDINARI - COSTI",null,4804290.84,4569599.68]
[null,"YC","IMPOSTE E TASSE - COSTI",null,12604622.770000001,12146610.959999999]
[null,null,"UTILE/PERDITA DI ESERCIZIO",null,{"$f":"(E366+E367+E368+E369)-(E370+E371+E372+E373+E374)","v":-14264709.560000539},{"$f":"(F366+F367+F368+F369)-(F370+F371+F372+F373+F374)","v":-13609624.259999514}]

{"sheet":"00 CE","index":2,"n_rows":488,"n_cols":7,"rows_kept":488,"cut":false,"hidden":false,"merged":[]}
[]
["AGG","CODICE","VOCE MODELLO CE",null,null,{"$f":"'00 Aggregatore'!E4","v":"Esercizio 2016"},{"$f":"'00 Aggregatore'!F4","v":"Esercizio 2017"}]
[null,null,"A)  Valore della produzione"]
[null,"AA0010","A.1)  Contributi in c/esercizio","S","AA0010",{"$f":"F5+F8+F21+F26","v":552960140.5999999},{"$f":"G5+G8+G21+G26","v":562861140.55000007}]
[null,"AA0020","A.1.A)  Contributi da Regione o Prov. Aut. per quota F.S. regionale","S","AA0020",{"$f":"SUM(F6:F7)","v":552467294.6099999},{"$f":"SUM(G6:G7)","v":562581352.20000005}]
[null,"AA0030","A.1.A.1)  da Regione o Prov. Aut. per quota F.S. regionale indistinto",null,"AA0030",{"$f":"SUMIF('00 Aggregatore'!$B:$B,'00 CE'!$E6,'00 Aggregatore'!E:E)","v":546383676.54999995},{"$f":"SUMIF('00 Aggregatore'!$B:$B,'00 CE'!$E6,'00 Aggregatore'!F:F)","v":547765886.61000001}]
[null,"AA0040","A.1.A.2)  da Regione o Prov. Aut. per quota F.S. regionale vincolato",null,"AA0040",{"$f":"SUMIF('00 Aggregatore'!$B:$B,'00 CE'!$E7,'00 Aggregatore'!E:E)","v":6083618.0599999996},{"$f":"SUMIF('00 Aggregatore'!$B:$B,'00 CE'!$E7,'00 Aggregatore'!F:F)","v":14815465.59}]
[null,"AA0050","A.1.B)  Contributi c/esercizio (extra fondo)","S","AA0050",{"$f":"F9+F14+F17","v":482629.99},{"$f":"G9+G14+G17","v":279788.34999999998}]
[null,"AA0060","A.1.B.1)  da Regione o Prov. Aut. (extra fondo) ","S","AA0060",{"$f":"SUM(F10:F13)","v":180605.96},{"$f":"SUM(G10:G13)","v":123104.1}]
[null,"AA0070","A.1.B.1.1)  Contributi da Regione o Prov. Aut. (extra fondo) vincolati",null,"AA0070",{"$f":"SUMIF('00 Aggregatore'!$B:$B,'00 CE'!$E10,'00 Aggregatore'!E:E)","v":180605.96},{"$f":"SUMIF('00 Aggregatore'!$B:$B,'00 CE'!$E10,'00 Aggregatore'!F:F)","v":123104.1}]
[null,"AA0080","A.1.B.1.2)  Contributi da Regione o Prov. Aut. (extra fondo) - Risorse aggiuntive da bilancio regionale a titolo di copertura LEA",null,"AA0080",{"$f":"SUMIF('00 Aggregatore'!$B:$B,'00 CE'!$E11,'00 Aggregatore'!E:E)","v":0},{"$f":"SUMIF('00 Aggregatore'!$B:$B,'00 CE'!$E11,'00 Aggregatore'!F:F)","v":0}]
[null,"AA0090","A.1.B.1.3)  Contributi da Regione o Prov. Aut. (extra fondo) - Risorse aggiuntive da bilancio regionale a titolo di copertura extra LEA",null,"AA0090",{"$f":"SUMIF('00 Aggregatore'!$B:$B,'00 CE'!$E12,'00 Aggregatore'!E:E)","v":0},{"$f":"SUMIF('00 Aggregatore'!$B:$B,'00 CE'!$E12,'00 Aggregatore'!F:F)","v":0}]
[null,"AA0100","A.1.B.1.4)  Contributi da Regione o Prov. Aut. (extra fondo) - Altro",null,"AA0100",{"$f":"SUMIF('00 Aggregatore'!$B:$B,'00 CE'!$E13,'00 Aggregatore'!E:E)","v":0},{"$f":"SUMIF('00 Aggregatore'!$B:$B,'00 CE'!$E13,'00 Aggregatore'!F:F)","v":0}]
[null,"AA0110","A.1.B.2)  Contributi da Aziende sanitarie pubbliche della Regione o Prov. Aut. (extra fondo) ","S","AA0110",{"$f":"SUM(F15:F16)","v":232003.28},{"$f":"SUM(G15:G16)","v":0}]
[null,"AA0120","A.1.B.2.1)  Contributi da Aziende sanitarie pubbliche della Regione o Prov. Aut. (extra fondo) vincolati",null,"AA0120",{"$f":"SUMIF('00 Aggregatore'!$B:$B,'00 CE'!$E15,'00 Aggregatore'!E:E)","v":0},{"$f":"SUMIF('00 Aggregatore'!$B:$B,'00 CE'!$E15,'00 Aggregatore'!F:F)","v":0}]
[null,"AA0130","A.1.B.2.2)  Contributi da Aziende sanitarie pubbliche della Regione o Prov. Aut. (extra fondo) altro",null,"AA0130",{"$f":"SUMIF('00 Aggregatore'!$B:$B,'00 CE'!$E16,'00 Aggregatore'!E:E)","v":232003.28},{"$f":"SUMIF('00 Aggregatore'!$B:$B,'00 CE'!$E16,'00 Aggregatore'!F:F)","v":0}]
[null,"AA0140","A.1.B.3)  Contributi da altri soggetti pubblici (extra fondo) ","S","AA0140",{"$f":"SUM(F18:F20)","v":70020.75},{"$f":"SUM(G18:G20)","v":156684.25}]
[null,"AA0150","A.1.B.3.1)  Contributi da altri soggetti pubblici (extra fondo) vincolati",null,"AA0150",{"$f":"SUMIF('00 Aggregatore'!$B:$B,'00 CE'!$E18,'00 Aggregatore'!E:E)","v":70020.75},{"$f":"SUMIF('00 Aggregatore'!$B:$B,'00 CE'!$E18,'00 Aggregatore'!F:F)","v":156684.25}]
[null,"AA0160","A.1.B.3.2)  Contributi da altri soggetti pubblici (extra fondo) L. 210/92",null,"AA0160",{"$f":"SUMIF('00 Aggregatore'!$B:$B,'00 CE'!$E19,'00 Aggregatore'!E:E)","v":0},{"$f":"SUMIF('00 Aggregatore'!$B:$B,'00 CE'!$E19,'00 Aggregatore'!F:F)","v":0}]
[null,"AA0170","A.1.B.3.3)  Contributi da altri soggetti pubblici (extra fondo) altro",null,"AA0170",{"$f":"SUMIF('00 Aggregatore'!$B:$B,'00 CE'!$E20,'00 Aggregatore'!E:E)","v":0},{"$f":"SUMIF('00 Aggregatore'!$B:$B,'00 CE'!$E20,'00 Aggregatore'!F:F)","v":0}]
[null,"AA0180","A.1.C)  Contributi c/esercizio per ricerca","S","AA0180",{"$f":"SUM(F22:F25)","v":10216},{"$f":"SUM(G22:G25)","v":0}]
[null,"AA0190","A.1.C.1)  Contributi da Ministero della Salute per ricerca corrente",null,"AA0190",{"$f":"SUMIF('00 Aggregatore'!$B:$B,'00 CE'!$E22,'00 Aggregatore'!E:E)","v":0},{"$f":"SUMIF('00 Aggregatore'!$B:$B,'00 CE'!$E22,'00 Aggregatore'!F:F)","v":0}]
[null,"AA0200","A.1.C.2)  Contributi da Ministero della Salute per ricerca finalizzata",null,"AA0200",{"$f":"SUMIF('00 Aggregatore'!$B:$B,'00 CE'!$E23,'00 Aggregatore'!E:E)","v":10216},{"$f":"SUMIF('00 Aggregatore'!$B:$B,'00 CE'!$E23,'00 Aggregatore'!F:F)","v":0}]
[null,"AA0210","A.1.C.3)  Contributi da Regione ed altri soggetti pubblici per ricerca",null,"AA0210",{"$f":"SUMIF('00 Aggregatore'!$B:$B,'00 CE'!$E24,'00 Aggregatore'!E:E)","v":0},{"$f":"SUMIF('00 Aggregatore'!$B:$B,'00 CE'!$E24,'00 Aggregatore'!F:F)","v":0}]
[null,"AA0220","A.1.C.4)  Contributi da privati per ricerca",null,"AA0220",{"$f":"SUMIF('00 Aggregatore'!$B:$B,'00 CE'!$E25,'00 Aggregatore'!E:E)","v":0},{"$f":"SUMIF('00 Aggregatore'!$B:$B,'00 CE'!$E25,'00 Aggregatore'!F:F)","v":0}]
[null,"AA0230","A.1.D)  Contributi c/esercizio da privati",null,"AA0230",{"$f":"SUMIF('00 Aggregatore'!$B:$B,'00 CE'!$E26,'00 Aggregatore'!E:E)","v":0},{"$f":"SUMIF('00 Aggregatore'!$B:$B,'00 CE'!$E26,'00 Aggregatore'!F:F)","v":0}]
[null,"AA0240","A.2)  Rettifica contributi c/esercizio per destinazione ad investimenti","S","AA0240",{"$f":"SUM(F28:F29)","v":-8787559.1099999994},{"$f":"SUM(G28:G29)","v":-6506318.8899999997}]
[null,"AA0250","A.2.A)  Rettifica contributi in c/esercizio per destinazione ad investimenti - da Regione o Prov. Aut. per quota F.S. regionale",null,"AA0250",{"$f":"SUMIF('00 Aggregatore'!$B:$B,'00 CE'!$E28,'00 Aggregatore'!E:E)","v":-8787559.1099999994},{"$f":"SUMIF('00 Aggregatore'!$B:$B,'00 CE'!$E28,'00 Aggregatore'!F:F)","v":-6506318.8899999997}]
[null,"AA0260","A.2.B)  Rettifica contributi in c/esercizio per destinazione ad investimenti - altri contributi",null,"AA0260",{"$f":"SUMIF('00 Aggregatore'!$B:$B,'00 CE'!$E29,'00 Aggregatore'!E:E)","v":0},{"$f":"SUMIF('00 Aggregatore'!$B:$B,'00 CE'!$E29,'00 Aggregatore'!F:F)","v":0}]
[null,"AA0270","A.3) Utilizzo fondi per quote inutilizzate contributi vincolati di esercizi precedenti","S","AA0270",{"$f":"SUM(F31:F34)","v":6260190.4800000004},{"$f":"SUM(G31:G34)","v":5773472.5599999996}]
[null,"AA0280","A.3.A)  Utilizzo fondi per quote inutilizzate contributi di esercizi precedenti da Regione o Prov. Aut. per quota F.S. regionale vincolato",null,"AA0280",{"$f":"SUMIF('00 Aggregatore'!$B:$B,'00 CE'!$E31,'00 Aggregatore'!E:E)","v":5960927.8300000001},{"$f":"SUMIF('00 Aggregatore'!$B:$B,'00 CE'!$E31,'00 Aggregatore'!F:F)","v":5681020.0999999996}]
[null,"AA0290","A.3.B) Utilizzo fondi per quote inutilizzate contributi di esercizi precedenti da soggetti pubblici (extra fondo) vincolati",null,"AA0290",{"$f":"SUMIF('00 Aggregatore'!$B:$B,'00 CE'!$E32,'00 Aggregatore'!E:E)","v":299262.65000000002},{"$f":"SUMIF('00 Aggregatore'!$B:$B,'00 CE'!$E32,'00 Aggregatore'!F:F)","v":92452.46}]
[null,"AA0300","A.3.C)  Utilizzo fondi per quote inutilizzate contributi di esercizi precedenti per ricerca",null,"AA0300",{"$f":"SUMIF('00 Aggregatore'!$B:$B,'00 CE'!$E33,'00 Aggregatore'!E:E)","v":0},{"$f":"SUMIF('00 Aggregatore'!$B:$B,'00 CE'!$E33,'00 Aggregatore'!F:F)","v":0}]
[null,"AA0310","A.3.D) Utilizzo fondi per quote inutilizzate contributi vincolati di esercizi precedenti da privati",null,"AA0310",{"$f":"SUMIF('00 Aggregatore'!$B:$B,'00 CE'!$E34,'00 Aggregatore'!E:E)","v":0},{"$f":"SUMIF('00 Aggregatore'!$B:$B,'00 CE'!$E34,'00 Aggregatore'!F:F)","v":0}]
[null,"AA0320","A.4)  Ricavi per prestazioni sanitarie e sociosanitarie a rilevanza sanitaria","S","AA0320",{"$f":"F36+F64+F69+F70","v":123908731.2},{"$f":"G36+G64+G69+G70","v":121845392.41000003}]
[null,"AA0330","A.4.A)  Ricavi per prestazioni sanitarie e sociosanitarie a rilevanza sanitaria erogate a soggetti pubblici ","S","AA0330",{"$f":"F37+F47+F48","v":104722872.61000001},{"$f":"G37+G47+G48","v":102220430.00000003}]
[null,"AA0340","A.4.A.1)  Ricavi per prestaz. sanitarie  e sociosanitarie a rilevanza sanitaria erogate ad Aziende sanitarie pubbliche della Regione","S","AA0340",{"$f":"SUM(F38:F46)","v":94245672.530000016},{"$f":"SUM(G38:G46)","v":96681059.590000018}]
[null,"AA0350","A.4.A.1.1) Prestazioni di ricovero",null,"AA0350",{"$f":"SUMIF('00 Aggregatore'!$B:$B,'00 CE'!$E38,'00 Aggregatore'!E:E)","v":60275803.049999997},{"$f":"SUMIF('00 Aggregatore'!$B:$B,'00 CE'!$E38,'00 Aggregatore'!F:F)","v":62109937.310000002}]
[null,"AA0360","A.4.A.1.2) Prestazioni di specialistica ambulatoriale",null,"AA0360",{"$f":"SUMIF('00 Aggregatore'!$B:$B,'00 CE'!$E39,'00 Aggregatore'!E:E)","v":7784926.8200000003},{"$f":"SUMIF('00 Aggregatore'!$B:$B,'00 CE'!$E39,'00 Aggregatore'!F:F)","v":8188514.2599999998}]
[null,"AA0370","A.4.A.1.3) Prestazioni di psichiatria residenziale e semiresidenziale",null,"AA0370",{"$f":"SUMIF('00 Aggregatore'!$B:$B,'00 CE'!$E40,'00 Aggregatore'!E:E)","v":4761138.87},{"$f":"SUMIF('00 Aggregatore'!$B:$B,'00 CE'!$E40,'00 Aggregatore'!F:F)","v":4556497.3099999996}]
[null,"AA0380","A.4.A.1.4) Prestazioni di File F",null,"AA0380",{"$f":"SUMIF('00 Aggregatore'!$B:$B,'00 CE'!$E41,'00 Aggregatore'!E:E)","v":13121092.029999999},{"$f":"SUMIF('00 Aggregatore'!$B:$B,'00 CE'!$E41,'00 Aggregatore'!F:F)","v":13565690.02}]
[null,"AA0390","A.4.A.1.5) Prestazioni servizi MMG, PLS, Contin. assistenziale",null,"AA0390",{"$f":"SUMIF('00 Aggregatore'!$B:$B,'00 CE'!$E42,'00 Aggregatore'!E:E)","v":204670},{"$f":"SUMIF('00 Aggregatore'!$B:$B,'00 CE'!$E42,'00 Aggregatore'!F:F)","v":57455.65}]
[null,"AA0400","A.4.A.1.6) Prestazioni servizi farmaceutica convenzionata",null,"AA0400",{"$f":"SUMIF('00 Aggregatore'!$B:$B,'00 CE'!$E43,'00 Aggregatore'!E:E)","v":1545791.88},{"$f":"SUMIF('00 Aggregatore'!$B:$B,'00 CE'!$E43,'00 Aggregatore'!F:F)","v":1531007.26}]
[null,"AA0410","A.4.A.1.7) Prestazioni termali",null,"AA0410",{"$f":"SUMIF('00 Aggregatore'!$B:$B,'00 CE'!$E44,'00 Aggregatore'!E:E)","v":1144807.45},{"$f":"SUMIF('00 Aggregatore'!$B:$B,'00 CE'!$E44,'00 Aggregatore'!F:F)","v":1104099.8899999999}]
[null,"AA0420","A.4.A.1.8) Prestazioni trasporto ambulanze ed elisoccorso",null,"AA0420",{"$f":"SUMIF('00 Aggregatore'!$B:$B,'00 CE'!$E45,'00 Aggregatore'!E:E)","v":202243.79},{"$f":"SUMIF('00 Aggregatore'!$B:$B,'00 CE'!$E45,'00 Aggregatore'!F:F)","v":175653.51}]
[null,"AA0430","A.4.A.1.9) Altre prestazioni sanitarie e socio-sanitarie a rilevanza sanitaria ",null,"AA0430",{"$f":"SUMIF('00 Aggregatore'!$B:$B,'00 CE'!$E46,'00 Aggregatore'!E:E)","v":5205198.6399999997},{"$f":"SUMIF('00 Aggregatore'!$B:$B,'00 CE'!$E46,'00 Aggregatore'!F:F)","v":5392204.3799999999}]
[null,"AA0440","A.4.A.2)   Ricavi per prestaz. sanitarie e sociosanitarie a rilevanza sanitaria erogate ad altri soggetti pubblici ",null,"AA0440",{"$f":"SUMIF('00 Aggregatore'!$B:$B,'00 CE'!$E47,'00 Aggregatore'!E:E)","v":40778.15},{"$f":"SUMIF('00 Aggregatore'!$B:$B,'00 CE'!$E47,'00 Aggregatore'!F:F)","v":45364.98}]
[null,"AA0450","A.4.A.3)   Ricavi per prestaz. sanitarie e sociosanitarie a rilevanza sanitaria erogate a soggetti pubblici Extraregione","S","AA0450",{"$f":"SUM(F49:F60)+F63","v":10436421.93},{"$f":"SUM(G49:G60)+G63","v":5494005.4299999997}]
[null,"AA0460","A.4.A.3.1) Prestazioni di ricovero",null,"AA0460",{"$f":"SUMIF('00 Aggregatore'!$B:$B,'00 CE'!$E49,'00 Aggregatore'!E:E)","v":6326378.1500000004},{"$f":"SUMIF('00 Aggregatore'!$B:$B,'00 CE'!$E49,'00 Aggregatore'!F:F)","v":1554681.22}]
[null,"AA0470","A.4.A.3.2) Prestazioni ambulatoriali",null,"AA0470",{"$f":"SUMIF('00 Aggregatore'!$B:$B,'00 CE'!$E50,'00 Aggregatore'!E:E)","v":1809228.39},{"$f":"SUMIF('00 Aggregatore'!$B:$B,'00 CE'!$E50,'00 Aggregatore'!F:F)","v":851774.85}]
[null,"AA0480","A.4.A.3.3) Prestazioni di psichiatria non soggetta a compensazione (resid. e semiresid.)",null,"AA0480",{"$f":"SUMIF('00 Aggregatore'!$B:$B,'00 CE'!$E51,'00 Aggregatore'!E:E)","v":0},{"$f":"SUMIF('00 Aggregatore'!$B:$B,'00 CE'!$E51,'00 Aggregatore'!F:F)","v":0}]
[null,"AA0490","A.4.A.3.4) Prestazioni di File F",null,"AA0490",{"$f":"SUMIF('00 Aggregatore'!$B:$B,'00 CE'!$E52,'00 Aggregatore'!E:E)","v":972613.7},{"$f":"SUMIF('00 Aggregatore'!$B:$B,'00 CE'!$E52,'00 Aggregatore'!F:F)","v":1604980.14}]
[null,"AA0500","A.4.A.3.5) Prestazioni servizi MMG, PLS, Contin. assistenziale Extraregione",null,"AA0500",{"$f":"SUMIF('00 Aggregatore'!$B:$B,'00 CE'!$E53,'00 Aggregatore'!E:E)","v":155741.96},{"$f":"SUMIF('00 Aggregatore'!$B:$B,'00 CE'!$E53,'00 Aggregatore'!F:F)","v":119388.84}]
[null,"AA0510","A.4.A.3.6) Prestazioni servizi farmaceutica convenzionata Extraregione",null,"AA0510",{"$f":"SUMIF('00 Aggregatore'!$B:$B,'00 CE'!$E54,'00 Aggregatore'!E:E)","v":523609.47},{"$f":"SUMIF('00 Aggregatore'!$B:$B,'00 CE'!$E54,'00 Aggregatore'!F:F)","v":502038.11}]
[null,"AA0520","A.4.A.3.7) Prestazioni termali Extraregione",null,"AA0520",{"$f":"SUMIF('00 Aggregatore'!$B:$B,'00 CE'!$E55,'00 Aggregatore'!E:E)","v":332335.62},{"$f":"SUMIF('00 Aggregatore'!$B:$B,'00 CE'!$E55,'00 Aggregatore'!F:F)","v":172275.4}]
[null,"AA0530","A.4.A.3.8) Prestazioni trasporto ambulanze ed elisoccorso Extraregione",null,"AA0530",{"$f":"SUMIF('00 Aggregatore'!$B:$B,'00 CE'!$E56,'00 Aggregatore'!E:E)","v":267907.44},{"$f":"SUMIF('00 Aggregatore'!$B:$B,'00 CE'!$E56,'00 Aggregatore'!F:F)","v":512404.02}]
[null,"AA0540","A.4.A.3.9) Altre prestazioni sanitarie e sociosanitarie a rilevanza sanitaria Extraregione",null,"AA0540",{"$f":"SUMIF('00 Aggregatore'!$B:$B,'00 CE'!$E57,'00 Aggregatore'!E:E)","v":0},{"$f":"SUMIF('00 Aggregatore'!$B:$B,'00 CE'!$E57,'00 Aggregatore'!F:F)","v":0}]
[null,"AA0550","A.4.A.3.10) Ricavi per cessione di emocomponenti e cellule staminali Extraregione",null,"AA0550",{"$f":"SUMIF('00 Aggregatore'!$B:$B,'00 CE'!$E58,'00 Aggregatore'!E:E)","v":813},{"$f":"SUMIF('00 Aggregatore'!$B:$B,'00 CE'!$E58,'00 Aggregatore'!F:F)","v":174766.05}]
[null,"AA0560","A.4.A.3.11) Ricavi per differenziale tariffe TUC",null,"AA0560",{"$f":"SUMIF('00 Aggregatore'!$B:$B,'00 CE'!$E59,'00 Aggregatore'!E:E)","v":0},{"$f":"SUMIF('00 Aggregatore'!$B:$B,'00 CE'!$E59,'00 Aggregatore'!F:F)","v":0}]
[null,"AA0570","A.4.A.3.12) Altre prestazioni sanitarie e sociosanitarie a rilevanza sanitaria non soggette a compensazione Extraregione","S","AA0570",{"$f":"SUM(F61:F62)","v":47794.200000000004},{"$f":"SUM(G61:G62)","v":1696.8}]
[null,"AA0580","A.4.A.3.12.A) Prestazioni di assistenza riabilitativa non soggette a compensazione Extraregione",null,"AA0580",{"$f":"SUMIF('00 Aggregatore'!$B:$B,'00 CE'!$E61,'00 Aggregatore'!E:E)","v":1860.9},{"$f":"SUMIF('00 Aggregatore'!$B:$B,'00 CE'!$E61,'00 Aggregatore'!F:F)","v":0}]
[null,"AA0590","A.4.A.3.12.B) Altre prestazioni sanitarie e socio-sanitarie a rilevanza sanitaria non soggette a compensazione Extraregione",null,"AA0590",{"$f":"SUMIF('00 Aggregatore'!$B:$B,'00 CE'!$E62,'00 Aggregatore'!E:E)","v":45933.3},{"$f":"SUMIF('00 Aggregatore'!$B:$B,'00 CE'!$E62,'00 Aggregatore'!F:F)","v":1696.8}]
[null,"AA0600","A.4.A.3.13) Altre prestazioni sanitarie a rilevanza sanitaria - Mobilità attiva Internazionale",null,"AA0600",{"$f":"SUMIF('00 Aggregatore'!$B:$B,'00 CE'!$E63,'00 Aggregatore'!E:E)","v":0},{"$f":"SUMIF('00 Aggregatore'!$B:$B,'00 CE'!$E63,'00 Aggregatore'!F:F)","v":0}]
[null,"AA0610","A.4.B)  Ricavi per prestazioni sanitarie e sociosanitarie a rilevanza sanitaria erogate da privati v/residenti Extraregione in compensazione (mobilità attiva)","S","AA0610",{"$f":"SUM(F65:F68)","v":11699257.520000001},{"$f":"SUM(G65:G68)","v":12136123.77}]
[null,"AA0620","A.4.B.1)  Prestazioni di ricovero da priv. Extraregione in compensazione (mobilità attiva)",null,"AA0620",{"$f":"SUMIF('00 Aggregatore'!$B:$B,'00 CE'!$E65,'00 Aggregatore'!E:E)","v":11496977.640000001},{"$f":"SUMIF('00 Aggregatore'!$B:$B,'00 CE'!$E65,'00 Aggregatore'!F:F)","v":11917704.07}]
[null,"AA0630","A.4.B.2)  Prestazioni ambulatoriali da priv. Extraregione in compensazione  (mobilità attiva)",null,"AA0630",{"$f":"SUMIF('00 Aggregatore'!$B:$B,'00 CE'!$E66,'00 Aggregatore'!E:E)","v":202279.88},{"$f":"SUMIF('00 Aggregatore'!$B:$B,'00 CE'!$E66,'00 Aggregatore'!F:F)","v":218419.7}]
[null,"AA0640","A.4.B.3)  Prestazioni di File F da priv. Extraregione in compensazione (mobilità attiva)",null,"AA0640",{"$f":"SUMIF('00 Aggregatore'!$B:$B,'00 CE'!$E67,'00 Aggregatore'!E:E)","v":0},{"$f":"SUMIF('00 Aggregatore'!$B:$B,'00 CE'!$E67,'00 Aggregatore'!F:F)","v":0}]
[null,"AA0650","A.4.B.4)  Altre prestazioni sanitarie e sociosanitarie a rilevanza sanitaria erogate da privati v/residenti Extraregione in compensazione (mobilità attiva)",null,"AA0650",{"$f":"SUMIF('00 Aggregatore'!$B:$B,'00 CE'!$E68,'00 Aggregatore'!E:E)","v":0},{"$f":"SUMIF('00 Aggregatore'!$B:$B,'00 CE'!$E68,'00 Aggregatore'!F:F)","v":0}]
[null,"AA0660","A.4.C)  Ricavi per prestazioni sanitarie e sociosanitarie a rilevanza sanitaria erogate a privati ",null,"AA0660",{"$f":"SUMIF('00 Aggregatore'!$B:$B,'00 CE'!$E69,'00 Aggregatore'!E:E)","v":3531032.8499999996},{"$f":"SUMIF('00 Aggregatore'!$B:$B,'00 CE'!$E69,'00 Aggregatore'!F:F)","v":3569406.3100000005}]
[null,"AA0670","A.4.D)  Ricavi per prestazioni sanitarie erogate in regime di intramoenia","S","AA0670",{"$f":"SUM(F71:F77)","v":3955568.2199999997},{"$f":"SUM(G71:G77)","v":3919432.33}]
[null,"AA0680","A.4.D.1)  Ricavi per prestazioni sanitarie intramoenia - Area ospedaliera",null,"AA0680",{"$f":"SUMIF('00 Aggregatore'!$B:$B,'00 CE'!$E71,'00 Aggregatore'!E:E)","v":89330.21},{"$f":"SUMIF('00 Aggregatore'!$B:$B,'00 CE'!$E71,'00 Aggregatore'!F:F)","v":50045.82}]
[null,"AA0690","A.4.D.2)  Ricavi per prestazioni sanitarie intramoenia - Area specialistica",null,"AA0690",{"$f":"SUMIF('00 Aggregatore'!$B:$B,'00 CE'!$E72,'00 Aggregatore'!E:E)","v":3216315.61},{"$f":"SUMIF('00 Aggregatore'!$B:$B,'00 CE'!$E72,'00 Aggregatore'!F:F)","v":3252006}]
[null,"AA0700","A.4.D.3)  Ricavi per prestazioni sanitarie intramoenia - Area sanità pubblica",null,"AA0700",{"$f":"SUMIF('00 Aggregatore'!$B:$B,'00 CE'!$E73,'00 Aggregatore'!E:E)","v":19348.810000000001},{"$f":"SUMIF('00 Aggregatore'!$B:$B,'00 CE'!$E73,'00 Aggregatore'!F:F)","v":22414.54}]
[null,"AA0710","A.4.D.4)  Ricavi per prestazioni sanitarie intramoenia - Consulenze (ex art. 55 c.1 lett. c), d) ed ex art. 57-58)",null,"AA0710",{"$f":"SUMIF('00 Aggregatore'!$B:$B,'00 CE'!$E74,'00 Aggregatore'!E:E)","v":520863.67},{"$f":"SUMIF('00 Aggregatore'!$B:$B,'00 CE'!$E74,'00 Aggregatore'!F:F)","v":478823.7}]
[null,"AA0720","A.4.D.5)  Ricavi per prestazioni sanitarie intramoenia - Consulenze (ex art. 55 c.1 lett. c), d) ed ex art. 57-58) (Aziende sanitarie pubbliche della Regione)",null,"AA0720",{"$f":"SUMIF('00 Aggregatore'!$B:$B,'00 CE'!$E75,'00 Aggregatore'!E:E)","v":0},{"$f":"SUMIF('00 Aggregatore'!$B:$B,'00 CE'!$E75,'00 Aggregatore'!F:F)","v":0}]
[null,"AA0730","A.4.D.6)  Ricavi per prestazioni sanitarie intramoenia - Altro",null,"AA0730",{"$f":"SUMIF('00 Aggregatore'!$B:$B,'00 CE'!$E76,'00 Aggregatore'!E:E)","v":109709.92},{"$f":"SUMIF('00 Aggregatore'!$B:$B,'00 CE'!$E76,'00 Aggregatore'!F:F)","v":97870.17}]
[null,"AA0740","A.4.D.7)  Ricavi per prestazioni sanitarie intramoenia - Altro (Aziende sanitarie pubbliche della Regione)",null,"AA0740",{"$f":"SUMIF('00 Aggregatore'!$B:$B,'00 CE'!$E77,'00 Aggregatore'!E:E)","v":0},{"$f":"SUMIF('00 Aggregatore'!$B:$B,'00 CE'!$E77,'00 Aggregatore'!F:F)","v":18272.099999999999}]
[null,"AA0750","A.5) Concorsi, recuperi e rimborsi","S","AA0750",{"$f":"F79+F80+F83+F87+F91","v":2960631.98},{"$f":"G79+G80+G83+G87+G91","v":4898267.1500000004}]
[null,"AA0760","A.5.A) Rimborsi assicurativi",null,"AA0760",{"$f":"SUMIF('00 Aggregatore'!$B:$B,'00 CE'!$E79,'00 Aggregatore'!E:E)","v":570386.93999999994},{"$f":"SUMIF('00 Aggregatore'!$B:$B,'00 CE'!$E79,'00 Aggregatore'!F:F)","v":166973.67000000001}]
[null,"AA0770","A.5.B) Concorsi, recuperi e rimborsi da Regione","S","AA0770",{"$f":"SUM(F81:F82)","v":0},{"$f":"SUM(G81:G82)","v":0}]
[null,"AA0780","A.5.B.1) Rimborso degli oneri stipendiali del personale dell'azienda in posizione di comando presso la Regione",null,"AA0780",{"$f":"SUMIF('00 Aggregatore'!$B:$B,'00 CE'!$E81,'00 Aggregatore'!E:E)","v":0},{"$f":"SUMIF('00 Aggregatore'!$B:$B,'00 CE'!$E81,'00 Aggregatore'!F:F)","v":0}]
[null,"AA0790","A.5.B.2) Altri concorsi, recuperi e rimborsi da parte della Regione",null,"AA0790",{"$f":"SUMIF('00 Aggregatore'!$B:$B,'00 CE'!$E82,'00 Aggregatore'!E:E)","v":0},{"$f":"SUMIF('00 Aggregatore'!$B:$B,'00 CE'!$E82,'00 Aggregatore'!F:F)","v":0}]
[null,"AA0800","A.5.C) Concorsi, recuperi e rimborsi da Aziende sanitarie pubbliche della Regione","S","AA0800",{"$f":"SUM(F84:F86)","v":142391.67000000001},{"$f":"SUM(G84:G86)","v":150230.1}]
[null,"AA0810","A.5.C.1) Rimborso degli oneri stipendiali del personale dipendente dell'azienda in posizione di comando presso Aziende sanitarie pubbliche della Regione",null,"AA0810",{"$f":"SUMIF('00 Aggregatore'!$B:$B,'00 CE'!$E84,'00 Aggregatore'!E:E)","v":0},{"$f":"SUMIF('00 Aggregatore'!$B:$B,'00 CE'!$E84,'00 Aggregatore'!F:F)","v":14346.46}]
[null,"AA0820","A.5.C.2) Rimborsi per acquisto beni da parte di Aziende sanitarie pubbliche della Regione",null,"AA0820",{"$f":"SUMIF('00 Aggregatore'!$B:$B,'00 CE'!$E85,'00 Aggregatore'!E:E)","v":0},{"$f":"SUMIF('00 Aggregatore'!$B:$B,'00 CE'!$E85,'00 Aggregatore'!F:F)","v":0}]
[null,"AA0830","A.5.C.3) Altri concorsi, recuperi e rimborsi da parte di Aziende sanitarie pubbliche della Regione",null,"AA0830",{"$f":"SUMIF('00 Aggregatore'!$B:$B,'00 CE'!$E86,'00 Aggregatore'!E:E)","v":142391.67000000001},{"$f":"SUMIF('00 Aggregatore'!$B:$B,'00 CE'!$E86,'00 Aggregatore'!F:F)","v":135883.64000000001}]
[null,"AA0840","A.5.D) Concorsi, recuperi e rimborsi da altri soggetti pubblici","S","AA0840",{"$f":"SUM(F88:F90)","v":141469.87},{"$f":"SUM(G88:G90)","v":287130.67}]
[null,"AA0850","A.5.D.1) Rimborso degli oneri stipendiali del personale dipendente dell'azienda in posizione di comando presso altri soggetti pubblici",null,"AA0850",{"$f":"SUMIF('00 Aggregatore'!$B:$B,'00 CE'!$E88,'00 Aggregatore'!E:E)","v":117798.94},{"$f":"SUMIF('00 Aggregatore'!$B:$B,'00 CE'!$E88,'00 Aggregatore'!F:F)","v":114750.81}]
[null,"AA0860","A.5.D.2) Rimborsi per acquisto beni da parte di altri soggetti pubblici",null,"AA0860",{"$f":"SUMIF('00 Aggregatore'!$B:$B,'00 CE'!$E89,'00 Aggregatore'!E:E)","v":19160.62},{"$f":"SUMIF('00 Aggregatore'!$B:$B,'00 CE'!$E89,'00 Aggregatore'!F:F)","v":14709.64}]
[null,"AA0870","A.5.D.3) Altri concorsi, recuperi e rimborsi da parte di altri soggetti pubblici",null,"AA0870",{"$f":"SUMIF('00 Aggregatore'!$B:$B,'00 CE'!$E90,'00 Aggregatore'!E:E)","v":4510.3100000000004},{"$f":"SUMIF('00 Aggregatore'!$B:$B,'00 CE'!$E90,'00 Aggregatore'!F:F)","v":157670.22}]
[null,"AA0880","A.5.E) Concorsi, recuperi e rimborsi da privati","S","AA0880",{"$f":"F92+F96","v":2106383.5},{"$f":"G92+G96","v":4293932.71}]
[null,"AA0890","A.5.E.1) Rimborso da aziende farmaceutiche per Pay back","S","AA0890",{"$f":"SUM(F93:F95)","v":1431892.14},{"$f":"SUM(G93:G95)","v":3426952.4}]
[null,"AA0900","A.5.E.1.1) Pay-back per il superamento del tetto della spesa farmaceutica territoriale",null,"AA0900",{"$f":"SUMIF('00 Aggregatore'!$B:$B,'00 CE'!$E93,'00 Aggregatore'!E:E)","v":0},{"$f":"SUMIF('00 Aggregatore'!$B:$B,'00 CE'!$E93,'00 Aggregatore'!F:F)","v":0}]
[null,"AA0910","A.5.E.1.2) Pay-back per superamento del tetto della spesa farmaceutica ospedaliera",null,"AA0910",{"$f":"SUMIF('00 Aggregatore'!$B:$B,'00 CE'!$E94,'00 Aggregatore'!E:E)","v":0},{"$f":"SUMIF('00 Aggregatore'!$B:$B,'00 CE'!$E94,'00 Aggregatore'!F:F)","v":20}]
[null,"AA0920","A.5.E.1.3) Ulteriore Pay-back",null,"AA0920",{"$f":"SUMIF('00 Aggregatore'!$B:$B,'00 CE'!$E95,'00 Aggregatore'!E:E)","v":1431892.14},{"$f":"SUMIF('00 Aggregatore'!$B:$B,'00 CE'!$E95,'00 Aggregatore'!F:F)","v":3426932.4}]
[null,"AA0930","A.5.E.2) Altri concorsi, recuperi e rimborsi da privati",null,"AA0930",{"$f":"SUMIF('00 Aggregatore'!$B:$B,'00 CE'!$E96,'00 Aggregatore'!E:E)","v":674491.36},{"$f":"SUMIF('00 Aggregatore'!$B:$B,'00 CE'!$E96,'00 Aggregatore'!F:F)","v":866980.31}]
[null,"AA0940","A.6)  Compartecipazione alla spesa per prestazioni sanitarie (Ticket)","S","AA0940",{"$f":"SUM(F98:F100)","v":6599350.3300000001},{"$f":"SUM(G98:G100)","v":6745092.0800000001}]
[null,"AA0950","A.6.A)  Compartecipazione alla spesa per prestazioni sanitarie - Ticket sulle prestazioni di specialistica ambulatoriale",null,"AA0950",{"$f":"SUMIF('00 Aggregatore'!$B:$B,'00 CE'!$E98,'00 Aggregatore'!E:E)","v":6032018.4100000001},{"$f":"SUMIF('00 Aggregatore'!$B:$B,'00 CE'!$E98,'00 Aggregatore'!F:F)","v":6414769.3200000003}]
[null,"AA0960","A.6.B)  Compartecipazione alla spesa per prestazioni sanitarie - Ticket sul pronto soccorso",null,"AA0960",{"$f":"SUMIF('00 Aggregatore'!$B:$B,'00 CE'!$E99,'00 Aggregatore'!E:E)","v":567331.92000000004},{"$f":"SUMIF('00 Aggregatore'!$B:$B,'00 CE'!$E99,'00 Aggregatore'!F:F)","v":330322.76}]
[null,"AA0970","A.6.C)  Compartecipazione alla spesa per prestazioni sanitarie (Ticket) - Altro",null,"AA0970",{"$f":"SUMIF('00 Aggregatore'!$B:$B,'00 CE'!$E100,'00 Aggregatore'!E:E)","v":0},{"$f":"SUMIF('00 Aggregatore'!$B:$B,'00 CE'!$E100,'00 Aggregatore'!F:F)","v":0}]
[null,"AA0980","A.7)  Quota contributi c/capitale imputata all'esercizio","S","AA0980",{"$f":"SUM(F102:F107)","v":8506490.2300000004},{"$f":"SUM(G102:G107)","v":9824993.1499999985}]
[null,"AA0990","A.7.A) Quota imputata all'esercizio dei finanziamenti per investimenti dallo Stato",null,"AA0990",{"$f":"SUMIF('00 Aggregatore'!$B:$B,'00 CE'!$E102,'00 Aggregatore'!E:E)","v":55380.81},{"$f":"SUMIF('00 Aggregatore'!$B:$B,'00 CE'!$E102,'00 Aggregatore'!F:F)","v":48286.07}]
[null,"AA1000","A.7.B)  Quota imputata all'esercizio dei finanziamenti per investimenti da Regione ",null,"AA1000",{"$f":"SUMIF('00 Aggregatore'!$B:$B,'00 CE'!$E103,'00 Aggregatore'!E:E)","v":1574332.01},{"$f":"SUMIF('00 Aggregatore'!$B:$B,'00 CE'!$E103,'00 Aggregatore'!F:F)","v":1468544.84}]
[null,"AA1010","A.7.C)  Quota imputata all'esercizio dei finanziamenti per beni di prima dotazione",null,"AA1010",{"$f":"SUMIF('00 Aggregatore'!$B:$B,'00 CE'!$E104,'00 Aggregatore'!E:E)","v":3577467.93},{"$f":"SUMIF('00 Aggregatore'!$B:$B,'00 CE'!$E104,'00 Aggregatore'!F:F)","v":3577467.93}]
[null,"AA1020","A.7.D) Quota imputata all'esercizio dei contributi in c/ esercizio FSR destinati ad investimenti",null,"AA1020",{"$f":"SUMIF('00 Aggregatore'!$B:$B,'00 CE'!$E105,'00 Aggregatore'!E:E)","v":3299309.48},{"$f":"SUMIF('00 Aggregatore'!$B:$B,'00 CE'!$E105,'00 Aggregatore'!F:F)","v":4730694.3099999996}]
[null,"AA1030","A.7.E) Quota imputata all'esercizio degli altri contributi in c/ esercizio destinati ad investimenti",null,"AA1030",{"$f":"SUMIF('00 Aggregatore'!$B:$B,'00 CE'!$E106,'00 Aggregatore'!E:E)","v":0},{"$f":"SUMIF('00 Aggregatore'!$B:$B,'00 CE'!$E106,'00 Aggregatore'!F:F)","v":0}]
[null,"AA1040","A.7.F) Quota imputata all'esercizio di altre poste del patrimonio netto",null,"AA1040",{"$f":"SUMIF('00 Aggregatore'!$B:$B,'00 CE'!$E107,'00 Aggregatore'!E:E)","v":0},{"$f":"SUMIF('00 Aggregatore'!$B:$B,'00 CE'!$E107,'00 Aggregatore'!F:F)","v":0}]
[null,"AA1050","A.8)  Incrementi delle immobilizzazioni per lavori interni",null,"AA1050",{"$f":"SUMIF('00 Aggregatore'!$B:$B,'00 CE'!$E108,'00 Aggregatore'!E:E)","v":0},{"$f":"SUMIF('00 Aggregatore'!$B:$B,'00 CE'!$E108,'00 Aggregatore'!F:F)","v":0}]
[null,"AA1060","A.9) Altri ricavi e proventi","S","AA1060",{"$f":"SUM(F110:F112)","v":534566.63},{"$f":"SUM(G110:G112)","v":622301.4}]
[null,"AA1070","A.9.A) Ricavi per prestazioni non sanitarie",null,"AA1070",{"$f":"SUMIF('00 Aggregatore'!$B:$B,'00 CE'!$E110,'00 Aggregatore'!E:E)","v":3563},{"$f":"SUMIF('00 Aggregatore'!$B:$B,'00 CE'!$E110,'00 Aggregatore'!F:F)","v":3023.66}]
[null,"AA1080","A.9.B) Fitti attivi ed altri proventi da attività immobiliari",null,"AA1080",{"$f":"SUMIF('00 Aggregatore'!$B:$B,'00 CE'!$E111,'00 Aggregatore'!E:E)","v":221554.44},{"$f":"SUMIF('00 Aggregatore'!$B:$B,'00 CE'!$E111,'00 Aggregatore'!F:F)","v":221560.64}]
[null,"AA1090","A.9.C) Altri proventi diversi",null,"AA1090",{"$f":"SUMIF('00 Aggregatore'!$B:$B,'00 CE'!$E112,'00 Aggregatore'!E:E)","v":309449.19},{"$f":"SUMIF('00 Aggregatore'!$B:$B,'00 CE'!$E112,'00 Aggregatore'!F:F)","v":397717.1}]
[null,"AZ9999","Totale valore della produzione (A)","S","AZ9999",{"$f":"F4+F27+F30+F35+F78+F97+F101+F108+F109","v":692942542.34000003},{"$f":"G4+G27+G30+G35+G78+G97+G101+G108+G109","v":706064340.41000009}]
[null,null,"B)  Costi della produzione"]
[null,"BA0010","B.1)  Acquisti di beni","S","BA0010",{"$f":"F116+F135","v":112786638.83999999},{"$f":"G116+G135","v":117076514.19000003}]
[null,"BA0020","B.1.A)  Acquisti di beni sanitari","S","BA0020",{"$f":"F117+F121+F125+SUM(F129:F134)","v":111731076.70999999},{"$f":"G117+G121+G125+SUM(G129:G134)","v":116128391.57000002}]
[null,"BA0030","B.1.A.1)  Prodotti farmaceutici ed emoderivati","S","BA0030",{"$f":"SUM(F118:F120)","v":67757822.909999996},{"$f":"SUM(G118:G120)","v":69958395.310000017}]
[null,"BA0040","B.1.A.1.1) Medicinali con AIC, ad eccezione di vaccini ed emoderivati di produzione regionale",null,"BA0040",{"$f":"SUMIF('00 Aggregatore'!$B:$B,'00 CE'!$E118,'00 Aggregatore'!E:E)","v":66456835.450000003},{"$f":"SUMIF('00 Aggregatore'!$B:$B,'00 CE'!$E118,'00 Aggregatore'!F:F)","v":69235809.470000014}]
[null,"BA0050","B.1.A.1.2) Medicinali senza AIC",null,"BA0050",{"$f":"SUMIF('00 Aggregatore'!$B:$B,'00 CE'!$E119,'00 Aggregatore'!E:E)","v":1300987.46},{"$f":"SUMIF('00 Aggregatore'!$B:$B,'00 CE'!$E119,'00 Aggregatore'!F:F)","v":722585.84}]
[null,"BA0060","B.1.A.1.3) Emoderivati di produzione regionale",null,"BA0060",{"$f":"SUMIF('00 Aggregatore'!$B:$B,'00 CE'!$E120,'00 Aggregatore'!E:E)","v":0},{"$f":"SUMIF('00 Aggregatore'!$B:$B,'00 CE'!$E120,'00 Aggregatore'!F:F)","v":0}]
[null,"BA0070","B.1.A.2)  Sangue ed emocomponenti","S","BA0070",{"$f":"SUM(F122:F124)","v":133040.57},{"$f":"SUM(G122:G124)","v":187348.99}]
[null,"BA0080","B.1.A.2.1) da pubblico (Aziende sanitarie pubbliche della Regione) – Mobilità intraregionale",null,"BA0080",{"$f":"SUMIF('00 Aggregatore'!$B:$B,'00 CE'!$E122,'00 Aggregatore'!E:E)","v":0},{"$f":"SUMIF('00 Aggregatore'!$B:$B,'00 CE'!$E122,'00 Aggregatore'!F:F)","v":0}]
[null,"BA0090","B.1.A.2.2) da pubblico (Aziende sanitarie pubbliche extra Regione) – Mobilità extraregionale",null,"BA0090",{"$f":"SUMIF('00 Aggregatore'!$B:$B,'00 CE'!$E123,'00 Aggregatore'!E:E)","v":133040.57},{"$f":"SUMIF('00 Aggregatore'!$B:$B,'00 CE'!$E123,'00 Aggregatore'!F:F)","v":187348.99}]
[null,"BA0100","B.1.A.2.3) da altri soggetti",null,"BA0100",{"$f":"SUMIF('00 Aggregatore'!$B:$B,'00 CE'!$E124,'00 Aggregatore'!E:E)","v":0},{"$f":"SUMIF('00 Aggregatore'!$B:$B,'00 CE'!$E124,'00 Aggregatore'!F:F)","v":0}]
[null,"BA0210","B.1.A.3) Dispositivi medici","S","BA0210",{"$f":"SUM(F126:F128)","v":40472326.140000001},{"$f":"SUM(G126:G128)","v":41189711.570000008}]
[null,"BA0220","B.1.A.3.1)  Dispositivi medici ",null,"BA0220",{"$f":"SUMIF('00 Aggregatore'!$B:$B,'00 CE'!$E126,'00 Aggregatore'!E:E)","v":25227619.200000003},{"$f":"SUMIF('00 Aggregatore'!$B:$B,'00 CE'!$E126,'00 Aggregatore'!F:F)","v":25764695.790000003}]
[null,"BA0230","B.1.A.3.2)  Dispositivi medici impiantabili attivi",null,"BA0230",{"$f":"SUMIF('00 Aggregatore'!$B:$B,'00 CE'!$E127,'00 Aggregatore'!E:E)","v":3795874.49},{"$f":"SUMIF('00 Aggregatore'!$B:$B,'00 CE'!$E127,'00 Aggregatore'!F:F)","v":3456008.28}]
[null,"BA0240","B.1.A.3.3)  Dispositivi medico diagnostici in vitro (IVD)",null,"BA0240",{"$f":"SUMIF('00 Aggregatore'!$B:$B,'00 CE'!$E128,'00 Aggregatore'!E:E)","v":11448832.449999999},{"$f":"SUMIF('00 Aggregatore'!$B:$B,'00 CE'!$E128,'00 Aggregatore'!F:F)","v":11969007.5}]
[null,"BA0250","B.1.A.4)  Prodotti dietetici",null,"BA0250",{"$f":"SUMIF('00 Aggregatore'!$B:$B,'00 CE'!$E129,'00 Aggregatore'!E:E)","v":440667.16000000003},{"$f":"SUMIF('00 Aggregatore'!$B:$B,'00 CE'!$E129,'00 Aggregatore'!F:F)","v":469645.74000000005}]
[null,"BA0260","B.1.A.5)  Materiali per la profilassi (vaccini)",null,"BA0260",{"$f":"SUMIF('00 Aggregatore'!$B:$B,'00 CE'!$E130,'00 Aggregatore'!E:E)","v":1380588.41},{"$f":"SUMIF('00 Aggregatore'!$B:$B,'00 CE'!$E130,'00 Aggregatore'!F:F)","v":2380862.56}]
[null,"BA0270","B.1.A.6)  Prodotti chimici",null,"BA0270",{"$f":"SUMIF('00 Aggregatore'!$B:$B,'00 CE'!$E131,'00 Aggregatore'!E:E)","v":0},{"$f":"SUMIF('00 Aggregatore'!$B:$B,'00 CE'!$E131,'00 Aggregatore'!F:F)","v":0}]
[null,"BA0280","B.1.A.7)  Materiali e prodotti per uso veterinario",null,"BA0280",{"$f":"SUMIF('00 Aggregatore'!$B:$B,'00 CE'!$E132,'00 Aggregatore'!E:E)","v":33301.29},{"$f":"SUMIF('00 Aggregatore'!$B:$B,'00 CE'!$E132,'00 Aggregatore'!F:F)","v":7852.7999999999993}]
[null,"BA0290","B.1.A.8)  Altri beni e prodotti sanitari",null,"BA0290",{"$f":"SUMIF('00 Aggregatore'!$B:$B,'00 CE'!$E133,'00 Aggregatore'!E:E)","v":1513330.23},{"$f":"SUMIF('00 Aggregatore'!$B:$B,'00 CE'!$E133,'00 Aggregatore'!F:F)","v":1934574.6}]
[null,"BA0300","B.1.A.9)  Beni e prodotti sanitari da Aziende sanitarie pubbliche della Regione",null,"BA0300",{"$f":"SUMIF('00 Aggregatore'!$B:$B,'00 CE'!$E134,'00 Aggregatore'!E:E)","v":0},{"$f":"SUMIF('00 Aggregatore'!$B:$B,'00 CE'!$E134,'00 Aggregatore'!F:F)","v":0}]
[null,"BA0310","B.1.B)  Acquisti di beni non sanitari","S","BA0310",{"$f":"SUM(F136:F142)","v":1055562.1300000001},{"$f":"SUM(G136:G142)","v":948122.62000000011}]
[null,"BA0320","B.1.B.1)  Prodotti alimentari",null,"BA0320",{"$f":"SUMIF('00 Aggregatore'!$B:$B,'00 CE'!$E136,'00 Aggregatore'!E:E)","v":259.32},{"$f":"SUMIF('00 Aggregatore'!$B:$B,'00 CE'!$E136,'00 Aggregatore'!F:F)","v":250.58}]
[null,"BA0330","B.1.B.2)  Materiali di guardaroba, di pulizia e di convivenza in genere",null,"BA0330",{"$f":"SUMIF('00 Aggregatore'!$B:$B,'00 CE'!$E137,'00 Aggregatore'!E:E)","v":29848.15},{"$f":"SUMIF('00 Aggregatore'!$B:$B,'00 CE'!$E137,'00 Aggregatore'!F:F)","v":41796.379999999997}]
[null,"BA0340","B.1.B.3)  Combustibili, carburanti e lubrificanti",null,"BA0340",{"$f":"SUMIF('00 Aggregatore'!$B:$B,'00 CE'!$E138,'00 Aggregatore'!E:E)","v":125554.88},{"$f":"SUMIF('00 Aggregatore'!$B:$B,'00 CE'!$E138,'00 Aggregatore'!F:F)","v":135937.70000000001}]
[null,"BA0350","B.1.B.4)  Supporti informatici e cancelleria",null,"BA0350",{"$f":"SUMIF('00 Aggregatore'!$B:$B,'00 CE'!$E139,'00 Aggregatore'!E:E)","v":597417.69000000006},{"$f":"SUMIF('00 Aggregatore'!$B:$B,'00 CE'!$E139,'00 Aggregatore'!F:F)","v":513727.87}]
[null,"BA0360","B.1.B.5)  Materiale per la manutenzione",null,"BA0360",{"$f":"SUMIF('00 Aggregatore'!$B:$B,'00 CE'!$E140,'00 Aggregatore'!E:E)","v":252738.81},{"$f":"SUMIF('00 Aggregatore'!$B:$B,'00 CE'!$E140,'00 Aggregatore'!F:F)","v":207783.52999999997}]
[null,"BA0370","B.1.B.6)  Altri beni e prodotti non sanitari",null,"BA0370",{"$f":"SUMIF('00 Aggregatore'!$B:$B,'00 CE'!$E141,'00 Aggregatore'!E:E)","v":49743.28},{"$f":"SUMIF('00 Aggregatore'!$B:$B,'00 CE'!$E141,'00 Aggregatore'!F:F)","v":48626.559999999998}]
[null,"BA0380","B.1.B.7)  Beni e prodotti non sanitari da Aziende sanitarie pubbliche della Regione",null,"BA0380",{"$f":"SUMIF('00 Aggregatore'!$B:$B,'00 CE'!$E142,'00 Aggregatore'!E:E)","v":0},{"$f":"SUMIF('00 Aggregatore'!$B:$B,'00 CE'!$E142,'00 Aggregatore'!F:F)","v":0}]
[null,"BA0390","B.2)  Acquisti di servizi","S","BA0390",{"$f":"F144+F260","v":367897552.23000014},{"$f":"G144+G260","v":368344821.86000001}]
[null,"BA0400","B.2.A)   Acquisti servizi sanitari","S","BA0400",{"$f":"F145+F153+F157+F168+F174+F179+F184+F194+F200+F207+F213+F218+F224+F232+F239+F253+F259","v":329975343.62000012},{"$f":"G145+G153+G157+G168+G174+G179+G184+G194+G200+G207+G213+G218+G224+G232+G239+G253+G259","v":331559072.38}]
[null,"BA0410","B.2.A.1)   Acquisti servizi sanitari per medicina di base","S","BA0410",{"$f":"F146+F151+F152","v":36146549.25},{"$f":"G146+G151+G152","v":35655655.119999997}]
[null,"BA0420","B.2.A.1.1) - da convenzione","S","BA0420",{"$f":"SUM(F147:F150)","v":35889765.890000001},{"$f":"SUM(G147:G150)","v":35435849.350000001}]
[null,"BA0430","B.2.A.1.1.A) Costi per assistenza MMG",null,"BA0430",{"$f":"SUMIF('00 Aggregatore'!$B:$B,'00 CE'!$E147,'00 Aggregatore'!E:E)","v":24527412.66},{"$f":"SUMIF('00 Aggregatore'!$B:$B,'00 CE'!$E147,'00 Aggregatore'!F:F)","v":24328709.329999998}]
[null,"BA0440","B.2.A.1.1.B) Costi per assistenza PLS",null,"BA0440",{"$f":"SUMIF('00 Aggregatore'!$B:$B,'00 CE'!$E148,'00 Aggregatore'!E:E)","v":6297522.9199999999},{"$f":"SUMIF('00 Aggregatore'!$B:$B,'00 CE'!$E148,'00 Aggregatore'!F:F)","v":6208374.4000000004}]
[null,"BA0450","B.2.A.1.1.C) Costi per assistenza Continuità assistenziale",null,"BA0450",{"$f":"SUMIF('00 Aggregatore'!$B:$B,'00 CE'!$E149,'00 Aggregatore'!E:E)","v":4154724.75},{"$f":"SUMIF('00 Aggregatore'!$B:$B,'00 CE'!$E149,'00 Aggregatore'!F:F)","v":4008916.53}]
[null,"BA0460","B.2.A.1.1.D) Altro (medicina dei servizi, psicologi, medici 118, ecc)",null,"BA0460",{"$f":"SUMIF('00 Aggregatore'!$B:$B,'00 CE'!$E150,'00 Aggregatore'!E:E)","v":910105.55999999994},{"$f":"SUMIF('00 Aggregatore'!$B:$B,'00 CE'!$E150,'00 Aggregatore'!F:F)","v":889849.09}]
[null,"BA0470","B.2.A.1.2) - da pubblico (Aziende sanitarie pubbliche della Regione) - Mobilità intraregionale",null,"BA0470",{"$f":"SUMIF('00 Aggregatore'!$B:$B,'00 CE'!$E151,'00 Aggregatore'!E:E)","v":83439.399999999994},{"$f":"SUMIF('00 Aggregatore'!$B:$B,'00 CE'!$E151,'00 Aggregatore'!F:F)","v":35057.19}]
[null,"BA0480","B.2.A.1.3) - da pubblico (Aziende sanitarie pubbliche Extraregione) - Mobilità extraregionale",null,"BA0480",{"$f":"SUMIF('00 Aggregatore'!$B:$B,'00 CE'!$E152,'00 Aggregatore'!E:E)","v":173343.96},{"$f":"SUMIF('00 Aggregatore'!$B:$B,'00 CE'!$E152,'00 Aggregatore'!F:F)","v":184748.58}]
[null,"BA0490","B.2.A.2)   Acquisti servizi sanitari per farmaceutica","S","BA0490",{"$f":"SUM(F154:F156)","v":54637066.849999994},{"$f":"SUM(G154:G156)","v":54563948.050000004}]
[null,"BA0500","B.2.A.2.1) - da convenzione",null,"BA0500",{"$f":"SUMIF('00 Aggregatore'!$B:$B,'00 CE'!$E154,'00 Aggregatore'!E:E)","v":53014279.899999999},{"$f":"SUMIF('00 Aggregatore'!$B:$B,'00 CE'!$E154,'00 Aggregatore'!F:F)","v":52924145.520000003}]
[null,"BA0510","B.2.A.2.2) - da pubblico (Aziende sanitarie pubbliche della Regione)- Mobilità intraregionale",null,"BA0510",{"$f":"SUMIF('00 Aggregatore'!$B:$B,'00 CE'!$E155,'00 Aggregatore'!E:E)","v":1241012.19},{"$f":"SUMIF('00 Aggregatore'!$B:$B,'00 CE'!$E155,'00 Aggregatore'!F:F)","v":1251970.51}]
[null,"BA0520","B.2.A.2.3) - da pubblico (Extraregione)",null,"BA0520",{"$f":"SUMIF('00 Aggregatore'!$B:$B,'00 CE'!$E156,'00 Aggregatore'!E:E)","v":381774.76},{"$f":"SUMIF('00 Aggregatore'!$B:$B,'00 CE'!$E156,'00 Aggregatore'!F:F)","v":387832.02}]
[null,"BA0530","B.2.A.3)   Acquisti servizi sanitari per assistenza specialistica ambulatoriale","S","BA0530",{"$f":"SUM(F158:F162)+F167","v":25704713.989999998},{"$f":"SUM(G158:G162)+G167","v":27519184.069999997}]
[null,"BA0540","B.2.A.3.1) - da pubblico (Aziende sanitarie pubbliche della Regione)",null,"BA0540",{"$f":"SUMIF('00 Aggregatore'!$B:$B,'00 CE'!$E158,'00 Aggregatore'!E:E)","v":8524168.6600000001},{"$f":"SUMIF('00 Aggregatore'!$B:$B,'00 CE'!$E158,'00 Aggregatore'!F:F)","v":8998122.1099999994}]
[null,"BA0550","B.2.A.3.2) - da pubblico (altri soggetti pubbl. della Regione)",null,"BA0550",{"$f":"SUMIF('00 Aggregatore'!$B:$B,'00 CE'!$E159,'00 Aggregatore'!E:E)","v":224364.91},{"$f":"SUMIF('00 Aggregatore'!$B:$B,'00 CE'!$E159,'00 Aggregatore'!F:F)","v":189344.67}]
[null,"BA0560","B.2.A.3.3) - da pubblico (Extraregione)",null,"BA0560",{"$f":"SUMIF('00 Aggregatore'!$B:$B,'00 CE'!$E160,'00 Aggregatore'!E:E)","v":3048586.34},{"$f":"SUMIF('00 Aggregatore'!$B:$B,'00 CE'!$E160,'00 Aggregatore'!F:F)","v":4460024.9400000004}]
[null,"BA0570","B.2.A.3.4) - da privato - Medici SUMAI",null,"BA0570",{"$f":"SUMIF('00 Aggregatore'!$B:$B,'00 CE'!$E161,'00 Aggregatore'!E:E)","v":5114503.17},{"$f":"SUMIF('00 Aggregatore'!$B:$B,'00 CE'!$E161,'00 Aggregatore'!F:F)","v":4899151.05}]
[null,"BA0580","B.2.A.3.5) - da privato","S","BA0580",{"$f":"SUM(F163:F166)","v":8596847.0599999987},{"$f":"SUM(G163:G166)","v":8757843.0999999996}]
[null,"BA0590","B.2.A.3.5.A) Servizi sanitari per assistenza specialistica da IRCCS privati e Policlinici privati",null,"BA0590",{"$f":"SUMIF('00 Aggregatore'!$B:$B,'00 CE'!$E163,'00 Aggregatore'!E:E)","v":44362.83},{"$f":"SUMIF('00 Aggregatore'!$B:$B,'00 CE'!$E163,'00 Aggregatore'!F:F)","v":60978.73}]
[null,"BA0600","B.2.A.3.5.B) Servizi sanitari per assistenza specialistica da Ospedali Classificati privati",null,"BA0600",{"$f":"SUMIF('00 Aggregatore'!$B:$B,'00 CE'!$E164,'00 Aggregatore'!E:E)","v":0},{"$f":"SUMIF('00 Aggregatore'!$B:$B,'00 CE'!$E164,'00 Aggregatore'!F:F)","v":0}]
[null,"BA0610","B.2.A.3.5.C) Servizi sanitari per assistenza specialistica da Case di Cura private",null,"BA0610",{"$f":"SUMIF('00 Aggregatore'!$B:$B,'00 CE'!$E165,'00 Aggregatore'!E:E)","v":5364433.0199999996},{"$f":"SUMIF('00 Aggregatore'!$B:$B,'00 CE'!$E165,'00 Aggregatore'!F:F)","v":5412858.8699999992}]
[null,"BA0620","B.2.A.3.5.D) Servizi sanitari per assistenza specialistica da altri privati",null,"BA0620",{"$f":"SUMIF('00 Aggregatore'!$B:$B,'00 CE'!$E166,'00 Aggregatore'!E:E)","v":3188051.21},{"$f":"SUMIF('00 Aggregatore'!$B:$B,'00 CE'!$E166,'00 Aggregatore'!F:F)","v":3284005.5}]
[null,"BA0630","B.2.A.3.6) - da privato per cittadini non residenti - Extraregione (mobilità attiva in compensazione)",null,"BA0630",{"$f":"SUMIF('00 Aggregatore'!$B:$B,'00 CE'!$E167,'00 Aggregatore'!E:E)","v":196243.84999999998},{"$f":"SUMIF('00 Aggregatore'!$B:$B,'00 CE'!$E167,'00 Aggregatore'!F:F)","v":214698.2}]
[null,"BA0640","B.2.A.4)   Acquisti servizi sanitari per assistenza riabilitativa","S","BA0640",{"$f":"SUM(F169:F173)","v":19761859.140000001},{"$f":"SUM(G169:G173)","v":19907207.98}]
[null,"BA0650","B.2.A.4.1) - da pubblico (Aziende sanitarie pubbliche della Regione)",null,"BA0650",{"$f":"SUMIF('00 Aggregatore'!$B:$B,'00 CE'!$E169,'00 Aggregatore'!E:E)","v":4525129.8},{"$f":"SUMIF('00 Aggregatore'!$B:$B,'00 CE'!$E169,'00 Aggregatore'!F:F)","v":4855060.17}]
[null,"BA0660","B.2.A.4.2) - da pubblico (altri soggetti pubbl. della Regione)",null,"BA0660",{"$f":"SUMIF('00 Aggregatore'!$B:$B,'00 CE'!$E170,'00 Aggregatore'!E:E)","v":0},{"$f":"SUMIF('00 Aggregatore'!$B:$B,'00 CE'!$E170,'00 Aggregatore'!F:F)","v":0}]
[null,"BA0670","B.2.A.4.3) - da pubblico (Extraregione) non soggetti a compensazione",null,"BA0670",{"$f":"SUMIF('00 Aggregatore'!$B:$B,'00 CE'!$E171,'00 Aggregatore'!E:E)","v":0},{"$f":"SUMIF('00 Aggregatore'!$B:$B,'00 CE'!$E171,'00 Aggregatore'!F:F)","v":0}]
[null,"BA0680","B.2.A.4.4) - da privato (intraregionale)",null,"BA0680",{"$f":"SUMIF('00 Aggregatore'!$B:$B,'00 CE'!$E172,'00 Aggregatore'!E:E)","v":14443763.359999999},{"$f":"SUMIF('00 Aggregatore'!$B:$B,'00 CE'!$E172,'00 Aggregatore'!F:F)","v":14460769.459999999}]
[null,"BA0690","B.2.A.4.5) - da privato (extraregionale)",null,"BA0690",{"$f":"SUMIF('00 Aggregatore'!$B:$B,'00 CE'!$E173,'00 Aggregatore'!E:E)","v":792965.98},{"$f":"SUMIF('00 Aggregatore'!$B:$B,'00 CE'!$E173,'00 Aggregatore'!F:F)","v":591378.35}]
[null,"BA0700","B.2.A.5)   Acquisti servizi sanitari per assistenza integrativa","S","BA0700",{"$f":"SUM(F175:F178)","v":1692964.4},{"$f":"SUM(G175:G178)","v":1813040.82}]
[null,"BA0710","B.2.A.5.1) - da pubblico (Aziende sanitarie pubbliche della Regione)",null,"BA0710",{"$f":"SUMIF('00 Aggregatore'!$B:$B,'00 CE'!$E175,'00 Aggregatore'!E:E)","v":0},{"$f":"SUMIF('00 Aggregatore'!$B:$B,'00 CE'!$E175,'00 Aggregatore'!F:F)","v":0}]
[null,"BA0720","B.2.A.5.2) - da pubblico (altri soggetti pubbl. della Regione)",null,"BA0720",{"$f":"SUMIF('00 Aggregatore'!$B:$B,'00 CE'!$E176,'00 Aggregatore'!E:E)","v":0},{"$f":"SUMIF('00 Aggregatore'!$B:$B,'00 CE'!$E176,'00 Aggregatore'!F:F)","v":0}]
[null,"BA0730","B.2.A.5.3) - da pubblico (Extraregione)",null,"BA0730",{"$f":"SUMIF('00 Aggregatore'!$B:$B,'00 CE'!$E177,'00 Aggregatore'!E:E)","v":0},{"$f":"SUMIF('00 Aggregatore'!$B:$B,'00 CE'!$E177,'00 Aggregatore'!F:F)","v":0}]
[null,"BA0740","B.2.A.5.4) - da privato",null,"BA0740",{"$f":"SUMIF('00 Aggregatore'!$B:$B,'00 CE'!$E178,'00 Aggregatore'!E:E)","v":1692964.4},{"$f":"SUMIF('00 Aggregatore'!$B:$B,'00 CE'!$E178,'00 Aggregatore'!F:F)","v":1813040.82}]
[null,"BA0750","B.2.A.6)   Acquisti servizi sanitari per assistenza protesica","S","BA0750",{"$f":"SUM(F180:F183)","v":6610863.3500000006},{"$f":"SUM(G180:G183)","v":6384295.54}]
[null,"BA0760","B.2.A.6.1) - da pubblico (Aziende sanitarie pubbliche della Regione)",null,"BA0760",{"$f":"SUMIF('00 Aggregatore'!$B:$B,'00 CE'!$E180,'00 Aggregatore'!E:E)","v":0},{"$f":"SUMIF('00 Aggregatore'!$B:$B,'00 CE'!$E180,'00 Aggregatore'!F:F)","v":0}]
[null,"BA0770","B.2.A.6.2) - da pubblico (altri soggetti pubbl. della Regione)",null,"BA0770",{"$f":"SUMIF('00 Aggregatore'!$B:$B,'00 CE'!$E181,'00 Aggregatore'!E:E)","v":0},{"$f":"SUMIF('00 Aggregatore'!$B:$B,'00 CE'!$E181,'00 Aggregatore'!F:F)","v":0}]
[null,"BA0780","B.2.A.6.3) - da pubblico (Extraregione)",null,"BA0780",{"$f":"SUMIF('00 Aggregatore'!$B:$B,'00 CE'!$E182,'00 Aggregatore'!E:E)","v":0},{"$f":"SUMIF('00 Aggregatore'!$B:$B,'00 CE'!$E182,'00 Aggregatore'!F:F)","v":0}]
[null,"BA0790","B.2.A.6.4) - da privato",null,"BA0790",{"$f":"SUMIF('00 Aggregatore'!$B:$B,'00 CE'!$E183,'00 Aggregatore'!E:E)","v":6610863.3500000006},{"$f":"SUMIF('00 Aggregatore'!$B:$B,'00 CE'!$E183,'00 Aggregatore'!F:F)","v":6384295.54}]
[null,"BA0800","B.2.A.7)   Acquisti servizi sanitari per assistenza ospedaliera","S","BA0800",{"$f":"SUM(F185:F188)+F193","v":124912983.22},{"$f":"SUM(G185:G188)+G193","v":125006439.52000001}]
[null,"BA0810","B.2.A.7.1) - da pubblico (Aziende sanitarie pubbliche della Regione)",null,"BA0810",{"$f":"SUMIF('00 Aggregatore'!$B:$B,'00 CE'!$E185,'00 Aggregatore'!E:E)","v":28209224.370000001},{"$f":"SUMIF('00 Aggregatore'!$B:$B,'00 CE'!$E185,'00 Aggregatore'!F:F)","v":28230091.68}]
[null,"BA0820","B.2.A.7.2) - da pubblico (altri soggetti pubbl. della Regione)",null,"BA0820",{"$f":"SUMIF('00 Aggregatore'!$B:$B,'00 CE'!$E186,'00 Aggregatore'!E:E)","v":0},{"$f":"SUMIF('00 Aggregatore'!$B:$B,'00 CE'!$E186,'00 Aggregatore'!F:F)","v":0}]
[null,"BA0830","B.2.A.7.3) - da pubblico (Extraregione)",null,"BA0830",{"$f":"SUMIF('00 Aggregatore'!$B:$B,'00 CE'!$E187,'00 Aggregatore'!E:E)","v":23636269.289999999},{"$f":"SUMIF('00 Aggregatore'!$B:$B,'00 CE'!$E187,'00 Aggregatore'!F:F)","v":23048879.050000001}]
[null,"BA0840","B.2.A.7.4) - da privato","S","BA0840",{"$f":"SUM(F189:F192)","v":61570511.920000002},{"$f":"SUM(G189:G192)","v":61809764.719999999}]
[null,"BA0850","B.2.A.7.4.A) Servizi sanitari per assistenza ospedaliera da IRCCS privati e Policlinici privati",null,"BA0850",{"$f":"SUMIF('00 Aggregatore'!$B:$B,'00 CE'!$E189,'00 Aggregatore'!E:E)","v":0},{"$f":"SUMIF('00 Aggregatore'!$B:$B,'00 CE'!$E189,'00 Aggregatore'!F:F)","v":0}]
[null,"BA0860","B.2.A.7.4.B) Servizi sanitari per assistenza ospedaliera da Ospedali Classificati privati",null,"BA0860",{"$f":"SUMIF('00 Aggregatore'!$B:$B,'00 CE'!$E190,'00 Aggregatore'!E:E)","v":0},{"$f":"SUMIF('00 Aggregatore'!$B:$B,'00 CE'!$E190,'00 Aggregatore'!F:F)","v":0}]
[null,"BA0870","B.2.A.7.4.C) Servizi sanitari per assistenza ospedaliera da Case di Cura private",null,"BA0870",{"$f":"SUMIF('00 Aggregatore'!$B:$B,'00 CE'!$E191,'00 Aggregatore'!E:E)","v":61570511.920000002},{"$f":"SUMIF('00 Aggregatore'!$B:$B,'00 CE'!$E191,'00 Aggregatore'!F:F)","v":61809764.719999999}]
[null,"BA0880","B.2.A.7.4.D) Servizi sanitari per assistenza ospedaliera da altri privati",null,"BA0880",{"$f":"SUMIF('00 Aggregatore'!$B:$B,'00 CE'!$E192,'00 Aggregatore'!E:E)","v":0},{"$f":"SUMIF('00 Aggregatore'!$B:$B,'00 CE'!$E192,'00 Aggregatore'!F:F)","v":0}]
[null,"BA0890","B.2.A.7.5) - da privato per cittadini non residenti - Extraregione (mobilità attiva in compensazione)",null,"BA0890",{"$f":"SUMIF('00 Aggregatore'!$B:$B,'00 CE'!$E193,'00 Aggregatore'!E:E)","v":11496977.640000001},{"$f":"SUMIF('00 Aggregatore'!$B:$B,'00 CE'!$E193,'00 Aggregatore'!F:F)","v":11917704.07}]
[null,"BA0900","B.2.A.8)   Acquisto prestazioni di psichiatria residenziale e semiresidenziale","S","BA0900",{"$f":"SUM(F195:F199)","v":13567821.24},{"$f":"SUM(G195:G199)","v":13199111.060000001}]
[null,"BA0910","B.2.A.8.1) - da pubblico (Aziende sanitarie pubbliche della Regione)",null,"BA0910",{"$f":"SUMIF('00 Aggregatore'!$B:$B,'00 CE'!$E195,'00 Aggregatore'!E:E)","v":1713800.54},{"$f":"SUMIF('00 Aggregatore'!$B:$B,'00 CE'!$E195,'00 Aggregatore'!F:F)","v":1648164.66}]
[null,"BA0920","B.2.A.8.2) - da pubblico (altri soggetti pubbl. della Regione)",null,"BA0920",{"$f":"SUMIF('00 Aggregatore'!$B:$B,'00 CE'!$E196,'00 Aggregatore'!E:E)","v":0},{"$f":"SUMIF('00 Aggregatore'!$B:$B,'00 CE'!$E196,'00 Aggregatore'!F:F)","v":0}]
[null,"BA0930","B.2.A.8.3) - da pubblico (Extraregione) - non soggette a compensazione",null,"BA0930",{"$f":"SUMIF('00 Aggregatore'!$B:$B,'00 CE'!$E197,'00 Aggregatore'!E:E)","v":32900.5},{"$f":"SUMIF('00 Aggregatore'!$B:$B,'00 CE'!$E197,'00 Aggregatore'!F:F)","v":6667}]
[null,"BA0940","B.2.A.8.4) - da privato (intraregionale)",null,"BA0940",{"$f":"SUMIF('00 Aggregatore'!$B:$B,'00 CE'!$E198,'00 Aggregatore'!E:E)","v":9642524.2799999993},{"$f":"SUMIF('00 Aggregatore'!$B:$B,'00 CE'!$E198,'00 Aggregatore'!F:F)","v":9671880.5899999999}]
[null,"BA0950","B.2.A.8.5) - da privato (extraregionale)",null,"BA0950",{"$f":"SUMIF('00 Aggregatore'!$B:$B,'00 CE'!$E199,'00 Aggregatore'!E:E)","v":2178595.92},{"$f":"SUMIF('00 Aggregatore'!$B:$B,'00 CE'!$E199,'00 Aggregatore'!F:F)","v":1872398.81}]
[null,"BA0960","B.2.A.9)   Acquisto prestazioni di distribuzione farmaci File F","S","BA0960",{"$f":"SUM(F201:F206)","v":6195810.8599999994},{"$f":"SUM(G201:G206)","v":5976832.0300000003}]
[null,"BA0970","B.2.A.9.1) - da pubblico (Aziende sanitarie pubbliche della Regione) - Mobilità intraregionale",null,"BA0970",{"$f":"SUMIF('00 Aggregatore'!$B:$B,'00 CE'!$E201,'00 Aggregatore'!E:E)","v":5023688.8099999996},{"$f":"SUMIF('00 Aggregatore'!$B:$B,'00 CE'!$E201,'00 Aggregatore'!F:F)","v":4391409.7}]
[null,"BA0980","B.2.A.9.2) - da pubblico (altri soggetti pubbl. della Regione)",null,"BA0980",{"$f":"SUMIF('00 Aggregatore'!$B:$B,'00 CE'!$E202,'00 Aggregatore'!E:E)","v":0},{"$f":"SUMIF('00 Aggregatore'!$B:$B,'00 CE'!$E202,'00 Aggregatore'!F:F)","v":0}]
[null,"BA0990","B.2.A.9.3) - da pubblico (Extraregione)",null,"BA0990",{"$f":"SUMIF('00 Aggregatore'!$B:$B,'00 CE'!$E203,'00 Aggregatore'!E:E)","v":1172122.05},{"$f":"SUMIF('00 Aggregatore'!$B:$B,'00 CE'!$E203,'00 Aggregatore'!F:F)","v":1585422.33}]
[null,"BA1000","B.2.A.9.4) - da privato (intraregionale)",null,"BA1000",{"$f":"SUMIF('00 Aggregatore'!$B:$B,'00 CE'!$E204,'00 Aggregatore'!E:E)","v":0},{"$f":"SUMIF('00 Aggregatore'!$B:$B,'00 CE'!$E204,'00 Aggregatore'!F:F)","v":0}]
[null,"BA1010","B.2.A.9.5) - da privato (extraregionale)",null,"BA1010",{"$f":"SUMIF('00 Aggregatore'!$B:$B,'00 CE'!$E205,'00 Aggregatore'!E:E)","v":0},{"$f":"SUMIF('00 Aggregatore'!$B:$B,'00 CE'!$E205,'00 Aggregatore'!F:F)","v":0}]
[null,"BA1020","B.2.A.9.6) - da privato per cittadini non residenti - Extraregione (mobilità attiva in compensazione)",null,"BA1020",{"$f":"SUMIF('00 Aggregatore'!$B:$B,'00 CE'!$E206,'00 Aggregatore'!E:E)","v":0},{"$f":"SUMIF('00 Aggregatore'!$B:$B,'00 CE'!$E206,'00 Aggregatore'!F:F)","v":0}]
[null,"BA1030","B.2.A.10)   Acquisto prestazioni termali in convenzione","S","BA1030",{"$f":"SUM(F208:F212)","v":2454064.39},{"$f":"SUM(G208:G212)","v":2288663.8299999996}]
[null,"BA1040","B.2.A.10.1) - da pubblico (Aziende sanitarie pubbliche della Regione) - Mobilità intraregionale",null,"BA1040",{"$f":"SUMIF('00 Aggregatore'!$B:$B,'00 CE'!$E208,'00 Aggregatore'!E:E)","v":46.2},{"$f":"SUMIF('00 Aggregatore'!$B:$B,'00 CE'!$E208,'00 Aggregatore'!F:F)","v":0}]
[null,"BA1050","B.2.A.10.2) - da pubblico (altri soggetti pubbl. della Regione)",null,"BA1050",{"$f":"SUMIF('00 Aggregatore'!$B:$B,'00 CE'!$E209,'00 Aggregatore'!E:E)","v":0},{"$f":"SUMIF('00 Aggregatore'!$B:$B,'00 CE'!$E209,'00 Aggregatore'!F:F)","v":0}]
[null,"BA1060","B.2.A.10.3) - da pubblico (Extraregione)",null,"BA1060",{"$f":"SUMIF('00 Aggregatore'!$B:$B,'00 CE'!$E210,'00 Aggregatore'!E:E)","v":199293.42},{"$f":"SUMIF('00 Aggregatore'!$B:$B,'00 CE'!$E210,'00 Aggregatore'!F:F)","v":159884.29}]
[null,"BA1070","B.2.A.10.4) - da privato",null,"BA1070",{"$f":"SUMIF('00 Aggregatore'!$B:$B,'00 CE'!$E211,'00 Aggregatore'!E:E)","v":1994460.87},{"$f":"SUMIF('00 Aggregatore'!$B:$B,'00 CE'!$E211,'00 Aggregatore'!F:F)","v":1888589.9699999997}]
[null,"BA1080","B.2.A.10.5) - da privato per cittadini non residenti - Extraregione (mobilità attiva in compensazione)",null,"BA1080",{"$f":"SUMIF('00 Aggregatore'!$B:$B,'00 CE'!$E212,'00 Aggregatore'!E:E)","v":260263.90000000002},{"$f":"SUMIF('00 Aggregatore'!$B:$B,'00 CE'!$E212,'00 Aggregatore'!F:F)","v":240189.57}]
[null,"BA1090","B.2.A.11)   Acquisto prestazioni di trasporto sanitario","S","BA1090",{"$f":"SUM(F214:F217)","v":7430925.1600000001},{"$f":"SUM(G214:G217)","v":8512737.8499999996}]
[null,"BA1100","B.2.A.11.1) - da pubblico (Aziende sanitarie pubbliche della Regione) - Mobilità intraregionale",null,"BA1100",{"$f":"SUMIF('00 Aggregatore'!$B:$B,'00 CE'!$E214,'00 Aggregatore'!E:E)","v":76616.539999999994},{"$f":"SUMIF('00 Aggregatore'!$B:$B,'00 CE'!$E214,'00 Aggregatore'!F:F)","v":124342.79}]
[null,"BA1110","B.2.A.11.2) - da pubblico (altri soggetti pubbl. della Regione)",null,"BA1110",{"$f":"SUMIF('00 Aggregatore'!$B:$B,'00 CE'!$E215,'00 Aggregatore'!E:E)","v":0},{"$f":"SUMIF('00 Aggregatore'!$B:$B,'00 CE'!$E215,'00 Aggregatore'!F:F)","v":0}]
[null,"BA1120","B.2.A.11.3) - da pubblico (Extraregione)",null,"BA1120",{"$f":"SUMIF('00 Aggregatore'!$B:$B,'00 CE'!$E216,'00 Aggregatore'!E:E)","v":91959.29},{"$f":"SUMIF('00 Aggregatore'!$B:$B,'00 CE'!$E216,'00 Aggregatore'!F:F)","v":228483.68}]
[null,"BA1130","B.2.A.11.4) - da privato",null,"BA1130",{"$f":"SUMIF('00 Aggregatore'!$B:$B,'00 CE'!$E217,'00 Aggregatore'!E:E)","v":7262349.3300000001},{"$f":"SUMIF('00 Aggregatore'!$B:$B,'00 CE'!$E217,'00 Aggregatore'!F:F)","v":8159911.3799999999}]
[null,"BA1140","B.2.A.12)   Acquisto prestazioni Socio-Sanitarie a rilevanza sanitaria","S","BA1140",{"$f":"SUM(F219:F223)","v":16691623.420000002},{"$f":"SUM(G219:G223)","v":16209312.369999997}]
[null,"BA1150","B.2.A.12.1) - da pubblico (Aziende sanitarie pubbliche della Regione) - Mobilità intraregionale",null,"BA1150",{"$f":"SUMIF('00 Aggregatore'!$B:$B,'00 CE'!$E219,'00 Aggregatore'!E:E)","v":1929611.4},{"$f":"SUMIF('00 Aggregatore'!$B:$B,'00 CE'!$E219,'00 Aggregatore'!F:F)","v":1737461.12}]
[null,"BA1160","B.2.A.12.2) - da pubblico (altri soggetti pubblici della Regione)",null,"BA1160",{"$f":"SUMIF('00 Aggregatore'!$B:$B,'00 CE'!$E220,'00 Aggregatore'!E:E)","v":0},{"$f":"SUMIF('00 Aggregatore'!$B:$B,'00 CE'!$E220,'00 Aggregatore'!F:F)","v":0}]
[null,"BA1170","B.2.A.12.3) - da pubblico (Extraregione) non soggette a compensazione",null,"BA1170",{"$f":"SUMIF('00 Aggregatore'!$B:$B,'00 CE'!$E221,'00 Aggregatore'!E:E)","v":334811.51},{"$f":"SUMIF('00 Aggregatore'!$B:$B,'00 CE'!$E221,'00 Aggregatore'!F:F)","v":168459.48}]
[null,"BA1180","B.2.A.12.4) - da privato (intraregionale)",null,"BA1180",{"$f":"SUMIF('00 Aggregatore'!$B:$B,'00 CE'!$E222,'00 Aggregatore'!E:E)","v":12820370.060000001},{"$f":"SUMIF('00 Aggregatore'!$B:$B,'00 CE'!$E222,'00 Aggregatore'!F:F)","v":12551624.019999998}]
[null,"BA1190","B.2.A.12.5) - da privato (extraregionale)",null,"BA1190",{"$f":"SUMIF('00 Aggregatore'!$B:$B,'00 CE'!$E223,'00 Aggregatore'!E:E)","v":1606830.4500000002},{"$f":"SUMIF('00 Aggregatore'!$B:$B,'00 CE'!$E223,'00 Aggregatore'!F:F)","v":1751767.75}]
[null,"BA1200","B.2.A.13)  Compartecipazione al personale per att. libero-prof. (intramoenia)","S","BA1200",{"$f":"SUM(F225:F231)","v":3292642.6900000004},{"$f":"SUM(G225:G231)","v":3293488.61}]
[null,"BA1210","B.2.A.13.1)  Compartecipazione al personale per att. libero professionale intramoenia - Area ospedaliera",null,"BA1210",{"$f":"SUMIF('00 Aggregatore'!$B:$B,'00 CE'!$E225,'00 Aggregatore'!E:E)","v":65875.14},{"$f":"SUMIF('00 Aggregatore'!$B:$B,'00 CE'!$E225,'00 Aggregatore'!F:F)","v":36801.340000000004}]
[null,"BA1220","B.2.A.13.2)  Compartecipazione al personale per att. libero professionale intramoenia- Area specialistica",null,"BA1220",{"$f":"SUMIF('00 Aggregatore'!$B:$B,'00 CE'!$E226,'00 Aggregatore'!E:E)","v":2668850.25},{"$f":"SUMIF('00 Aggregatore'!$B:$B,'00 CE'!$E226,'00 Aggregatore'!F:F)","v":2790651.77}]
[null,"BA1230","B.2.A.13.3)  Compartecipazione al personale per att. libero professionale intramoenia - Area sanità pubblica",null,"BA1230",{"$f":"SUMIF('00 Aggregatore'!$B:$B,'00 CE'!$E227,'00 Aggregatore'!E:E)","v":16818.95},{"$f":"SUMIF('00 Aggregatore'!$B:$B,'00 CE'!$E227,'00 Aggregatore'!F:F)","v":19073.689999999999}]
[null,"BA1240","B.2.A.13.4)  Compartecipazione al personale per att. libero professionale intramoenia - Consulenze (ex art. 55 c.1 lett. c), d) ed ex Art. 57-58)",null,"BA1240",{"$f":"SUMIF('00 Aggregatore'!$B:$B,'00 CE'!$E228,'00 Aggregatore'!E:E)","v":444810.38},{"$f":"SUMIF('00 Aggregatore'!$B:$B,'00 CE'!$E228,'00 Aggregatore'!F:F)","v":371493.34}]
[null,"BA1250","B.2.A.13.5)  Compartecipazione al personale per att. libero professionale intramoenia - Consulenze (ex art. 55 c.1 lett. c), d) ed ex Art. 57-58) (Aziende sanitarie pubbliche della Regione)",null,"BA1250",{"$f":"SUMIF('00 Aggregatore'!$B:$B,'00 CE'!$E229,'00 Aggregatore'!E:E)","v":0},{"$f":"SUMIF('00 Aggregatore'!$B:$B,'00 CE'!$E229,'00 Aggregatore'!F:F)","v":0}]
[null,"BA1260","B.2.A.13.6)  Compartecipazione al personale per att. libero professionale intramoenia - Altro",null,"BA1260",{"$f":"SUMIF('00 Aggregatore'!$B:$B,'00 CE'!$E230,'00 Aggregatore'!E:E)","v":96287.97},{"$f":"SUMIF('00 Aggregatore'!$B:$B,'00 CE'!$E230,'00 Aggregatore'!F:F)","v":75468.47}]
[null,"BA1270","B.2.A.13.7)  Compartecipazione al personale per att. libero  professionale intramoenia - Altro (Aziende sanitarie pubbliche della Regione)",null,"BA1270",{"$f":"SUMIF('00 Aggregatore'!$B:$B,'00 CE'!$E231,'00 Aggregatore'!E:E)","v":0},{"$f":"SUMIF('00 Aggregatore'!$B:$B,'00 CE'!$E231,'00 Aggregatore'!F:F)","v":0}]
[null,"BA1280","B.2.A.14)  Rimborsi, assegni e contributi sanitari","S","BA1280",{"$f":"SUM(F233:F238)","v":2158483.7199999997},{"$f":"SUM(G233:G238)","v":1751188.4500000002}]
[null,"BA1290","B.2.A.14.1)  Contributi ad associazioni di volontariato",null,"BA1290",{"$f":"SUMIF('00 Aggregatore'!$B:$B,'00 CE'!$E233,'00 Aggregatore'!E:E)","v":473982},{"$f":"SUMIF('00 Aggregatore'!$B:$B,'00 CE'!$E233,'00 Aggregatore'!F:F)","v":326600}]
[null,"BA1300","B.2.A.14.2)  Rimborsi per cure all'estero",null,"BA1300",{"$f":"SUMIF('00 Aggregatore'!$B:$B,'00 CE'!$E234,'00 Aggregatore'!E:E)","v":15911.61},{"$f":"SUMIF('00 Aggregatore'!$B:$B,'00 CE'!$E234,'00 Aggregatore'!F:F)","v":0}]
[null,"BA1310","B.2.A.14.3)  Contributi a società partecipate e/o enti dipendenti della Regione",null,"BA1310",{"$f":"SUMIF('00 Aggregatore'!$B:$B,'00 CE'!$E235,'00 Aggregatore'!E:E)","v":0},{"$f":"SUMIF('00 Aggregatore'!$B:$B,'00 CE'!$E235,'00 Aggregatore'!F:F)","v":0}]
[null,"BA1320","B.2.A.14.4)  Contributo Legge 210/92",null,"BA1320",{"$f":"SUMIF('00 Aggregatore'!$B:$B,'00 CE'!$E236,'00 Aggregatore'!E:E)","v":0},{"$f":"SUMIF('00 Aggregatore'!$B:$B,'00 CE'!$E236,'00 Aggregatore'!F:F)","v":0}]
[null,"BA1330","B.2.A.14.5)  Altri rimborsi, assegni e contributi",null,"BA1330",{"$f":"SUMIF('00 Aggregatore'!$B:$B,'00 CE'!$E237,'00 Aggregatore'!E:E)","v":1482389.1099999999},{"$f":"SUMIF('00 Aggregatore'!$B:$B,'00 CE'!$E237,'00 Aggregatore'!F:F)","v":1424508.4500000002}]
[null,"BA1340","B.2.A.14.6)  Rimborsi, assegni e contributi v/Aziende sanitarie pubbliche della Regione",null,"BA1340",{"$f":"SUMIF('00 Aggregatore'!$B:$B,'00 CE'!$E238,'00 Aggregatore'!E:E)","v":186201},{"$f":"SUMIF('00 Aggregatore'!$B:$B,'00 CE'!$E238,'00 Aggregatore'!F:F)","v":80}]
[null,"BA1350","B.2.A.15)  Consulenze, Collaborazioni,  Interinale e altre prestazioni di lavoro sanitarie e sociosanitarie","S","BA1350",{"$f":"SUM(F240:F242)+F249","v":6203271.4700000007},{"$f":"SUM(G240:G242)+G249","v":6723251.46}]
[null,"BA1360","B.2.A.15.1) Consulenze sanitarie e sociosan. da Aziende sanitarie pubbliche della Regione",null,"BA1360",{"$f":"SUMIF('00 Aggregatore'!$B:$B,'00 CE'!$E240,'00 Aggregatore'!E:E)","v":368369.4},{"$f":"SUMIF('00 Aggregatore'!$B:$B,'00 CE'!$E240,'00 Aggregatore'!F:F)","v":298526.69}]
[null,"BA1370","B.2.A.15.2) Consulenze sanitarie e sociosanit. da terzi - Altri soggetti pubblici",null,"BA1370",{"$f":"SUMIF('00 Aggregatore'!$B:$B,'00 CE'!$E241,'00 Aggregatore'!E:E)","v":90118.47},{"$f":"SUMIF('00 Aggregatore'!$B:$B,'00 CE'!$E241,'00 Aggregatore'!F:F)","v":24433.75}]
[null,"BA1380","B.2.A.15.3) Consulenze, Collaborazioni,  Interinale e altre prestazioni di lavoro sanitarie e socios. da privato","S","BA1380",{"$f":"SUM(F243:F248)","v":5703679.1500000004},{"$f":"SUM(G243:G248)","v":6390500.9299999997}]
[null,"BA1390","B.2.A.15.3.A) Consulenze sanitarie da privato - articolo 55, comma 2, CCNL 8 giugno 2000",null,"BA1390",{"$f":"SUMIF('00 Aggregatore'!$B:$B,'00 CE'!$E243,'00 Aggregatore'!E:E)","v":2656011.58},{"$f":"SUMIF('00 Aggregatore'!$B:$B,'00 CE'!$E243,'00 Aggregatore'!F:F)","v":2372315.1800000002}]
[null,"BA1400","B.2.A.15.3.B) Altre consulenze sanitarie e sociosanitarie da privato",null,"BA1400",{"$f":"SUMIF('00 Aggregatore'!$B:$B,'00 CE'!$E244,'00 Aggregatore'!E:E)","v":9289.34},{"$f":"SUMIF('00 Aggregatore'!$B:$B,'00 CE'!$E244,'00 Aggregatore'!F:F)","v":8005.29}]
[null,"BA1410","B.2.A.15.3.C) Collaborazioni coordinate e continuative sanitarie e socios. da privato",null,"BA1410",{"$f":"SUMIF('00 Aggregatore'!$B:$B,'00 CE'!$E245,'00 Aggregatore'!E:E)","v":13270.74},{"$f":"SUMIF('00 Aggregatore'!$B:$B,'00 CE'!$E245,'00 Aggregatore'!F:F)","v":8413.1200000000008}]
[null,"BA1420","B.2.A.15.3.D) Indennità a personale universitario - area sanitaria ",null,"BA1420",{"$f":"SUMIF('00 Aggregatore'!$B:$B,'00 CE'!$E246,'00 Aggregatore'!E:E)","v":252571.97},{"$f":"SUMIF('00 Aggregatore'!$B:$B,'00 CE'!$E246,'00 Aggregatore'!F:F)","v":242210.34}]
[null,"BA1430","B.2.A.15.3.E) Lavoro interinale - area sanitaria ",null,"BA1430",{"$f":"SUMIF('00 Aggregatore'!$B:$B,'00 CE'!$E247,'00 Aggregatore'!E:E)","v":1558908.64},{"$f":"SUMIF('00 Aggregatore'!$B:$B,'00 CE'!$E247,'00 Aggregatore'!F:F)","v":2608784.9}]
[null,"BA1440","B.2.A.15.3.F) Altre collaborazioni e prestazioni di lavoro - area sanitaria ",null,"BA1440",{"$f":"SUMIF('00 Aggregatore'!$B:$B,'00 CE'!$E248,'00 Aggregatore'!E:E)","v":1213626.8799999999},{"$f":"SUMIF('00 Aggregatore'!$B:$B,'00 CE'!$E248,'00 Aggregatore'!F:F)","v":1150772.0999999999}]
[null,"BA1450","B.2.A.15.4) Rimborso oneri stipendiali del personale sanitario in comando","S","BA1450",{"$f":"SUM(F250:F252)","v":41104.449999999997},{"$f":"SUM(G250:G252)","v":9790.09}]
[null,"BA1460","B.2.A.15.4.A) Rimborso oneri stipendiali personale sanitario in comando da Aziende sanitarie pubbliche della Regione",null,"BA1460",{"$f":"SUMIF('00 Aggregatore'!$B:$B,'00 CE'!$E250,'00 Aggregatore'!E:E)","v":0},{"$f":"SUMIF('00 Aggregatore'!$B:$B,'00 CE'!$E250,'00 Aggregatore'!F:F)","v":0}]
[null,"BA1470","B.2.A.15.4.B) Rimborso oneri stipendiali personale sanitario in comando da Regioni, soggetti pubblici e da Università",null,"BA1470",{"$f":"SUMIF('00 Aggregatore'!$B:$B,'00 CE'!$E251,'00 Aggregatore'!E:E)","v":0},{"$f":"SUMIF('00 Aggregatore'!$B:$B,'00 CE'!$E251,'00 Aggregatore'!F:F)","v":0}]
[null,"BA1480","B.2.A.15.4.C) Rimborso oneri stipendiali personale sanitario in comando da aziende di altre Regioni (Extraregione)",null,"BA1480",{"$f":"SUMIF('00 Aggregatore'!$B:$B,'00 CE'!$E252,'00 Aggregatore'!E:E)","v":41104.449999999997},{"$f":"SUMIF('00 Aggregatore'!$B:$B,'00 CE'!$E252,'00 Aggregatore'!F:F)","v":9790.09}]
[null,"BA1490","B.2.A.16) Altri servizi sanitari e sociosanitari a rilevanza sanitaria","S","BA1490",{"$f":"SUM(F254:F258)","v":2513700.4700000002},{"$f":"SUM(G254:G258)","v":2754715.62}]
[null,"BA1500","B.2.A.16.1)  Altri servizi sanitari e sociosanitari a rilevanza sanitaria da pubblico - Aziende sanitarie pubbliche della Regione",null,"BA1500",{"$f":"SUMIF('00 Aggregatore'!$B:$B,'00 CE'!$E254,'00 Aggregatore'!E:E)","v":50483.02},{"$f":"SUMIF('00 Aggregatore'!$B:$B,'00 CE'!$E254,'00 Aggregatore'!F:F)","v":13109.54}]
[null,"BA1510","B.2.A.16.2)  Altri servizi sanitari e sociosanitari  a rilevanza sanitaria da pubblico - Altri soggetti pubblici della Regione",null,"BA1510",{"$f":"SUMIF('00 Aggregatore'!$B:$B,'00 CE'!$E255,'00 Aggregatore'!E:E)","v":0},{"$f":"SUMIF('00 Aggregatore'!$B:$B,'00 CE'!$E255,'00 Aggregatore'!F:F)","v":0}]
[null,"BA1520","B.2.A.16.3) Altri servizi sanitari e sociosanitari a rilevanza sanitaria da pubblico (Extraregione)",null,"BA1520",{"$f":"SUMIF('00 Aggregatore'!$B:$B,'00 CE'!$E256,'00 Aggregatore'!E:E)","v":0},{"$f":"SUMIF('00 Aggregatore'!$B:$B,'00 CE'!$E256,'00 Aggregatore'!F:F)","v":0}]
[null,"BA1530","B.2.A.16.4)  Altri servizi sanitari da privato",null,"BA1530",{"$f":"SUMIF('00 Aggregatore'!$B:$B,'00 CE'!$E257,'00 Aggregatore'!E:E)","v":2463217.4500000002},{"$f":"SUMIF('00 Aggregatore'!$B:$B,'00 CE'!$E257,'00 Aggregatore'!F:F)","v":2741606.08}]
[null,"BA1540","B.2.A.16.5)  Costi per servizi sanitari - Mobilità internazionale passiva",null,"BA1540",{"$f":"SUMIF('00 Aggregatore'!$B:$B,'00 CE'!$E258,'00 Aggregatore'!E:E)","v":0},{"$f":"SUMIF('00 Aggregatore'!$B:$B,'00 CE'!$E258,'00 Aggregatore'!F:F)","v":0}]
[null,"BA1550","B.2.A.17) Costi per differenziale tariffe TUC",null,"BA1550",{"$f":"SUMIF('00 Aggregatore'!$B:$B,'00 CE'!$E259,'00 Aggregatore'!E:E)","v":0},{"$f":"SUMIF('00 Aggregatore'!$B:$B,'00 CE'!$E259,'00 Aggregatore'!F:F)","v":0}]
[null,"BA1560","B.2.B) Acquisti di servizi non sanitari","S","BA1560",{"$f":"F261+F279+F292","v":37922208.609999992},{"$f":"G261+G279+G292","v":36785749.479999989}]
[null,"BA1570","B.2.B.1) Servizi non sanitari ","S","BA1570",{"$f":"SUM(F262:F272)+F275","v":36561957.619999997},{"$f":"SUM(G262:G272)+G275","v":35538780.359999992}]
[null,"BA1580","B.2.B.1.1)   Lavanderia",null,"BA1580",{"$f":"SUMIF('00 Aggregatore'!$B:$B,'00 CE'!$E262,'00 Aggregatore'!E:E)","v":6717141.3899999997},{"$f":"SUMIF('00 Aggregatore'!$B:$B,'00 CE'!$E262,'00 Aggregatore'!F:F)","v":5274953.32}]
[null,"BA1590","B.2.B.1.2)   Pulizia",null,"BA1590",{"$f":"SUMIF('00 Aggregatore'!$B:$B,'00 CE'!$E263,'00 Aggregatore'!E:E)","v":6128265.6900000004},{"$f":"SUMIF('00 Aggregatore'!$B:$B,'00 CE'!$E263,'00 Aggregatore'!F:F)","v":6089443.3399999999}]
[null,"BA1600","B.2.B.1.3)   Mensa",null,"BA1600",{"$f":"SUMIF('00 Aggregatore'!$B:$B,'00 CE'!$E264,'00 Aggregatore'!E:E)","v":3982167.1},{"$f":"SUMIF('00 Aggregatore'!$B:$B,'00 CE'!$E264,'00 Aggregatore'!F:F)","v":4117793.49}]
[null,"BA1610","B.2.B.1.4)   Riscaldamento",null,"BA1610",{"$f":"SUMIF('00 Aggregatore'!$B:$B,'00 CE'!$E265,'00 Aggregatore'!E:E)","v":1027893.49},{"$f":"SUMIF('00 Aggregatore'!$B:$B,'00 CE'!$E265,'00 Aggregatore'!F:F)","v":1064233.96}]
[null,"BA1620","B.2.B.1.5)   Servizi di assistenza informatica",null,"BA1620",{"$f":"SUMIF('00 Aggregatore'!$B:$B,'00 CE'!$E266,'00 Aggregatore'!E:E)","v":1500622.2},{"$f":"SUMIF('00 Aggregatore'!$B:$B,'00 CE'!$E266,'00 Aggregatore'!F:F)","v":1666759.65}]
[null,"BA1630","B.2.B.1.6)   Servizi trasporti (non sanitari)",null,"BA1630",{"$f":"SUMIF('00 Aggregatore'!$B:$B,'00 CE'!$E267,'00 Aggregatore'!E:E)","v":0},{"$f":"SUMIF('00 Aggregatore'!$B:$B,'00 CE'!$E267,'00 Aggregatore'!F:F)","v":9272}]
[null,"BA1640","B.2.B.1.7)   Smaltimento rifiuti",null,"BA1640",{"$f":"SUMIF('00 Aggregatore'!$B:$B,'00 CE'!$E268,'00 Aggregatore'!E:E)","v":1294794.04},{"$f":"SUMIF('00 Aggregatore'!$B:$B,'00 CE'!$E268,'00 Aggregatore'!F:F)","v":1384638.6300000001}]
[null,"BA1650","B.2.B.1.8)   Utenze telefoniche",null,"BA1650",{"$f":"SUMIF('00 Aggregatore'!$B:$B,'00 CE'!$E269,'00 Aggregatore'!E:E)","v":493458.34},{"$f":"SUMIF('00 Aggregatore'!$B:$B,'00 CE'!$E269,'00 Aggregatore'!F:F)","v":524835.69999999995}]
[null,"BA1660","B.2.B.1.9)   Utenze elettricità",null,"BA1660",{"$f":"SUMIF('00 Aggregatore'!$B:$B,'00 CE'!$E270,'00 Aggregatore'!E:E)","v":3423484.08},{"$f":"SUMIF('00 Aggregatore'!$B:$B,'00 CE'!$E270,'00 Aggregatore'!F:F)","v":3156167.9}]
[null,"BA1670","B.2.B.1.10)   Altre utenze",null,"BA1670",{"$f":"SUMIF('00 Aggregatore'!$B:$B,'00 CE'!$E271,'00 Aggregatore'!E:E)","v":461862.87},{"$f":"SUMIF('00 Aggregatore'!$B:$B,'00 CE'!$E271,'00 Aggregatore'!F:F)","v":705877.73}]
[null,"BA1680","B.2.B.1.11)  Premi di assicurazione","S","BA1680",{"$f":"SUM(F273:F274)","v":4906195.92},{"$f":"SUM(G273:G274)","v":4810016.04}]
[null,"BA1690","B.2.B.1.11.A)  Premi di assicurazione - R.C. Professionale ",null,"BA1690",{"$f":"SUMIF('00 Aggregatore'!$B:$B,'00 CE'!$E273,'00 Aggregatore'!E:E)","v":4540618.17},{"$f":"SUMIF('00 Aggregatore'!$B:$B,'00 CE'!$E273,'00 Aggregatore'!F:F)","v":4466553.17}]
[null,"BA1700","B.2.B.1.11.B)  Premi di assicurazione - Altri premi assicurativi",null,"BA1700",{"$f":"SUMIF('00 Aggregatore'!$B:$B,'00 CE'!$E274,'00 Aggregatore'!E:E)","v":365577.75},{"$f":"SUMIF('00 Aggregatore'!$B:$B,'00 CE'!$E274,'00 Aggregatore'!F:F)","v":343462.87}]
[null,"BA1710","B.2.B.1.12) Altri servizi non sanitari","S","BA1710",{"$f":"SUM(F276:F278)","v":6626072.5000000009},{"$f":"SUM(G276:G278)","v":6734788.6000000006}]
[null,"BA1720","B.2.B.1.12.A) Altri servizi non sanitari da pubblico (Aziende sanitarie pubbliche della Regione)",null,"BA1720",{"$f":"SUMIF('00 Aggregatore'!$B:$B,'00 CE'!$E276,'00 Aggregatore'!E:E)","v":0},{"$f":"SUMIF('00 Aggregatore'!$B:$B,'00 CE'!$E276,'00 Aggregatore'!F:F)","v":0}]
[null,"BA1730","B.2.B.1.12.B) Altri servizi non sanitari da altri soggetti pubblici",null,"BA1730",{"$f":"SUMIF('00 Aggregatore'!$B:$B,'00 CE'!$E277,'00 Aggregatore'!E:E)","v":0},{"$f":"SUMIF('00 Aggregatore'!$B:$B,'00 CE'!$E277,'00 Aggregatore'!F:F)","v":0}]
[null,"BA1740","B.2.B.1.12.C) Altri servizi non sanitari da privato",null,"BA1740",{"$f":"SUMIF('00 Aggregatore'!$B:$B,'00 CE'!$E278,'00 Aggregatore'!E:E)","v":6626072.5000000009},{"$f":"SUMIF('00 Aggregatore'!$B:$B,'00 CE'!$E278,'00 Aggregatore'!F:F)","v":6734788.6000000006}]
[null,"BA1750","B.2.B.2)  Consulenze, Collaborazioni, Interinale e altre prestazioni di lavoro non sanitarie","S","BA1750",{"$f":"SUM(F280:F282)+F288","v":731816.37},{"$f":"SUM(G280:G282)+G288","v":649624.89999999991}]
[null,"BA1760","B.2.B.2.1) Consulenze non sanitarie da Aziende sanitarie pubbliche della Regione",null,"BA1760",{"$f":"SUMIF('00 Aggregatore'!$B:$B,'00 CE'!$E280,'00 Aggregatore'!E:E)","v":0},{"$f":"SUMIF('00 Aggregatore'!$B:$B,'00 CE'!$E280,'00 Aggregatore'!F:F)","v":0}]
[null,"BA1770","B.2.B.2.2) Consulenze non sanitarie da Terzi - Altri soggetti pubblici",null,"BA1770",{"$f":"SUMIF('00 Aggregatore'!$B:$B,'00 CE'!$E281,'00 Aggregatore'!E:E)","v":0},{"$f":"SUMIF('00 Aggregatore'!$B:$B,'00 CE'!$E281,'00 Aggregatore'!F:F)","v":0}]
[null,"BA1780","B.2.B.2.3) Consulenze, Collaborazioni, Interinale e altre prestazioni di lavoro non sanitarie da privato","S","BA1780",{"$f":"SUM(F283:F287)","v":731816.37},{"$f":"SUM(G283:G287)","v":649624.89999999991}]
[null,"BA1790","B.2.B.2.3.A) Consulenze non sanitarie da privato",null,"BA1790",{"$f":"SUMIF('00 Aggregatore'!$B:$B,'00 CE'!$E283,'00 Aggregatore'!E:E)","v":614217.07999999996},{"$f":"SUMIF('00 Aggregatore'!$B:$B,'00 CE'!$E283,'00 Aggregatore'!F:F)","v":518707.44999999995}]
[null,"BA1800","B.2.B.2.3.B) Collaborazioni coordinate e continuative non sanitarie da privato",null,"BA1800",{"$f":"SUMIF('00 Aggregatore'!$B:$B,'00 CE'!$E284,'00 Aggregatore'!E:E)","v":25849.06},{"$f":"SUMIF('00 Aggregatore'!$B:$B,'00 CE'!$E284,'00 Aggregatore'!F:F)","v":13535.39}]
[null,"BA1810","B.2.B.2.3.C) Indennità a personale universitario - area non sanitaria ",null,"BA1810",{"$f":"SUMIF('00 Aggregatore'!$B:$B,'00 CE'!$E285,'00 Aggregatore'!E:E)","v":0},{"$f":"SUMIF('00 Aggregatore'!$B:$B,'00 CE'!$E285,'00 Aggregatore'!F:F)","v":0}]
[null,"BA1820","B.2.B.2.3.D) Lavoro interinale - area non sanitaria ",null,"BA1820",{"$f":"SUMIF('00 Aggregatore'!$B:$B,'00 CE'!$E286,'00 Aggregatore'!E:E)","v":0},{"$f":"SUMIF('00 Aggregatore'!$B:$B,'00 CE'!$E286,'00 Aggregatore'!F:F)","v":0}]
[null,"BA1830","B.2.B.2.3.E) Altre collaborazioni e prestazioni di lavoro - area non sanitaria ",null,"BA1830",{"$f":"SUMIF('00 Aggregatore'!$B:$B,'00 CE'!$E287,'00 Aggregatore'!E:E)","v":91750.23},{"$f":"SUMIF('00 Aggregatore'!$B:$B,'00 CE'!$E287,'00 Aggregatore'!F:F)","v":117382.06}]
[null,"BA1840","B.2.B.2.4) Rimborso oneri stipendiali del personale non sanitario in comando","S","BA1840",{"$f":"SUM(F289:F291)","v":0},{"$f":"SUM(G289:G291)","v":0}]
[null,"BA1850","B.2.B.2.4.A) Rimborso oneri stipendiali personale non sanitario in comando da Aziende sanitarie pubbliche della Regione",null,"BA1850",{"$f":"SUMIF('00 Aggregatore'!$B:$B,'00 CE'!$E289,'00 Aggregatore'!E:E)","v":0},{"$f":"SUMIF('00 Aggregatore'!$B:$B,'00 CE'!$E289,'00 Aggregatore'!F:F)","v":0}]
[null,"BA1860","B.2.B.2.4.B) Rimborso oneri stipendiali personale non sanitario in comando da Regione, soggetti pubblici e da Università",null,"BA1860",{"$f":"SUMIF('00 Aggregatore'!$B:$B,'00 CE'!$E290,'00 Aggregatore'!E:E)","v":0},{"$f":"SUMIF('00 Aggregatore'!$B:$B,'00 CE'!$E290,'00 Aggregatore'!F:F)","v":0}]
[null,"BA1870","B.2.B.2.4.C) Rimborso oneri stipendiali personale non sanitario in comando da aziende di altre Regioni (Extraregione)",null,"BA1870",{"$f":"SUMIF('00 Aggregatore'!$B:$B,'00 CE'!$E291,'00 Aggregatore'!E:E)","v":0},{"$f":"SUMIF('00 Aggregatore'!$B:$B,'00 CE'!$E291,'00 Aggregatore'!F:F)","v":0}]
[null,"BA1880","B.2.B.3) Formazione (esternalizzata e non)","S","BA1880",{"$f":"SUM(F293:F294)","v":628434.62},{"$f":"SUM(G293:G294)","v":597344.22}]
[null,"BA1890","B.2.B.3.1) Formazione (esternalizzata e non) da pubblico",null,"BA1890",{"$f":"SUMIF('00 Aggregatore'!$B:$B,'00 CE'!$E293,'00 Aggregatore'!E:E)","v":67387.399999999994},{"$f":"SUMIF('00 Aggregatore'!$B:$B,'00 CE'!$E293,'00 Aggregatore'!F:F)","v":81237.64}]
[null,"BA1900","B.2.B.3.2) Formazione (esternalizzata e non) da privato",null,"BA1900",{"$f":"SUMIF('00 Aggregatore'!$B:$B,'00 CE'!$E294,'00 Aggregatore'!E:E)","v":561047.22},{"$f":"SUMIF('00 Aggregatore'!$B:$B,'00 CE'!$E294,'00 Aggregatore'!F:F)","v":516106.58}]
[null,"BA1910","B.3)  Manutenzione e riparazione (ordinaria esternalizzata)","S","BA1910",{"$f":"SUM(F296:F302)","v":14308552.839999998},{"$f":"SUM(G296:G302)","v":15729686.23}]
[null,"BA1920","B.3.A)  Manutenzione e riparazione ai fabbricati e loro pertinenze",null,"BA1920",{"$f":"SUMIF('00 Aggregatore'!$B:$B,'00 CE'!$E296,'00 Aggregatore'!E:E)","v":7832253.2599999998},{"$f":"SUMIF('00 Aggregatore'!$B:$B,'00 CE'!$E296,'00 Aggregatore'!F:F)","v":9244877.5800000001}]
[null,"BA1930","B.3.B)  Manutenzione e riparazione agli impianti e macchinari",null,"BA1930",{"$f":"SUMIF('00 Aggregatore'!$B:$B,'00 CE'!$E297,'00 Aggregatore'!E:E)","v":0},{"$f":"SUMIF('00 Aggregatore'!$B:$B,'00 CE'!$E297,'00 Aggregatore'!F:F)","v":0}]
[null,"BA1940","B.3.C)  Manutenzione e riparazione alle attrezzature sanitarie e scientifiche",null,"BA1940",{"$f":"SUMIF('00 Aggregatore'!$B:$B,'00 CE'!$E298,'00 Aggregatore'!E:E)","v":5435954.5999999996},{"$f":"SUMIF('00 Aggregatore'!$B:$B,'00 CE'!$E298,'00 Aggregatore'!F:F)","v":5502395.79}]
[null,"BA1950","B.3.D)  Manutenzione e riparazione ai mobili e arredi",null,"BA1950",{"$f":"SUMIF('00 Aggregatore'!$B:$B,'00 CE'!$E299,'00 Aggregatore'!E:E)","v":0},{"$f":"SUMIF('00 Aggregatore'!$B:$B,'00 CE'!$E299,'00 Aggregatore'!F:F)","v":0}]
[null,"BA1960","B.3.E)  Manutenzione e riparazione agli automezzi",null,"BA1960",{"$f":"SUMIF('00 Aggregatore'!$B:$B,'00 CE'!$E300,'00 Aggregatore'!E:E)","v":132622.04},{"$f":"SUMIF('00 Aggregatore'!$B:$B,'00 CE'!$E300,'00 Aggregatore'!F:F)","v":109400.27}]
[null,"BA1970","B.3.F)  Altre manutenzioni e riparazioni",null,"BA1970",{"$f":"SUMIF('00 Aggregatore'!$B:$B,'00 CE'!$E301,'00 Aggregatore'!E:E)","v":907722.94},{"$f":"SUMIF('00 Aggregatore'!$B:$B,'00 CE'!$E301,'00 Aggregatore'!F:F)","v":873012.59}]
[null,"BA1980","B.3.G)  Manutenzioni e riparazioni da Aziende sanitarie pubbliche della Regione",null,"BA1980",{"$f":"SUMIF('00 Aggregatore'!$B:$B,'00 CE'!$E302,'00 Aggregatore'!E:E)","v":0},{"$f":"SUMIF('00 Aggregatore'!$B:$B,'00 CE'!$E302,'00 Aggregatore'!F:F)","v":0}]
[null,"BA1990","B.4)   Godimento di beni di terzi","S","BA1990",{"$f":"F304+F305+F308+F311","v":7537448.540000001},{"$f":"G304+G305+G308+G311","v":6492272.2400000002}]
[null,"BA2000","B.4.A)  Fitti passivi",null,"BA2000",{"$f":"SUMIF('00 Aggregatore'!$B:$B,'00 CE'!$E304,'00 Aggregatore'!E:E)","v":1206607.57},{"$f":"SUMIF('00 Aggregatore'!$B:$B,'00 CE'!$E304,'00 Aggregatore'!F:F)","v":1239352.47}]
[null,"BA2010","B.4.B)  Canoni di noleggio","S","BA2010",{"$f":"SUM(F306:F307)","v":5344470.9700000007},{"$f":"SUM(G306:G307)","v":5252919.7700000005}]
[null,"BA2020","B.4.B.1) Canoni di noleggio - area sanitaria",null,"BA2020",{"$f":"SUMIF('00 Aggregatore'!$B:$B,'00 CE'!$E306,'00 Aggregatore'!E:E)","v":4860200.24},{"$f":"SUMIF('00 Aggregatore'!$B:$B,'00 CE'!$E306,'00 Aggregatore'!F:F)","v":4790860.33}]
[null,"BA2030","B.4.B.2) Canoni di noleggio - area non sanitaria",null,"BA2030",{"$f":"SUMIF('00 Aggregatore'!$B:$B,'00 CE'!$E307,'00 Aggregatore'!E:E)","v":484270.73000000004},{"$f":"SUMIF('00 Aggregatore'!$B:$B,'00 CE'!$E307,'00 Aggregatore'!F:F)","v":462059.44}]
[null,"BA2040","B.4.C)  Canoni di leasing","S","BA2040",{"$f":"SUM(F309:F310)","v":986370},{"$f":"SUM(G309:G310)","v":0}]
[null,"BA2050","B.4.C.1) Canoni di leasing - area sanitaria",null,"BA2050",{"$f":"SUMIF('00 Aggregatore'!$B:$B,'00 CE'!$E309,'00 Aggregatore'!E:E)","v":986370},{"$f":"SUMIF('00 Aggregatore'!$B:$B,'00 CE'!$E309,'00 Aggregatore'!F:F)","v":0}]
[null,"BA2060","B.4.C.2) Canoni di leasing - area non sanitaria",null,"BA2060",{"$f":"SUMIF('00 Aggregatore'!$B:$B,'00 CE'!$E310,'00 Aggregatore'!E:E)","v":0},{"$f":"SUMIF('00 Aggregatore'!$B:$B,'00 CE'!$E310,'00 Aggregatore'!F:F)","v":0}]
[null,"BA2070","B.4.D)  Locazioni e noleggi da Aziende sanitarie pubbliche della Regione",null,"BA2070",{"$f":"SUMIF('00 Aggregatore'!$B:$B,'00 CE'!$E311,'00 Aggregatore'!E:E)","v":0},{"$f":"SUMIF('00 Aggregatore'!$B:$B,'00 CE'!$E311,'00 Aggregatore'!F:F)","v":0}]
[null,"BA2080","Totale Costo del personale","S","BA2080",{"$f":"F313+F327+F336+F345","v":167744028.73999998},{"$f":"G313+G327+G336+G345","v":165244202.44}]
[null,"BA2090","B.5)   Personale del ruolo sanitario","S","BA2090",{"$f":"F314+F323","v":140347883.47999999},{"$f":"G314+G323","v":138175218.69}]
[null,"BA2100","B.5.A) Costo del personale dirigente ruolo sanitario","S","BA2100",{"$f":"F315+F319","v":74326376.919999987},{"$f":"G315+G319","v":73318273.719999999}]
[null,"BA2110","B.5.A.1) Costo del personale dirigente medico","S","BA2110",{"$f":"SUM(F316:F318)","v":69192940.819999993},{"$f":"SUM(G316:G318)","v":68148859.189999998}]
[null,"BA2120","B.5.A.1.1) Costo del personale dirigente medico - tempo indeterminato",null,"BA2120",{"$f":"SUMIF('00 Aggregatore'!$B:$B,'00 CE'!$E316,'00 Aggregatore'!E:E)","v":67708491.459999993},{"$f":"SUMIF('00 Aggregatore'!$B:$B,'00 CE'!$E316,'00 Aggregatore'!F:F)","v":66243178.869999997}]
[null,"BA2130","B.5.A.1.2) Costo del personale dirigente medico - tempo determinato",null,"BA2130",{"$f":"SUMIF('00 Aggregatore'!$B:$B,'00 CE'!$E317,'00 Aggregatore'!E:E)","v":1484449.36},{"$f":"SUMIF('00 Aggregatore'!$B:$B,'00 CE'!$E317,'00 Aggregatore'!F:F)","v":1905680.32}]
[null,"BA2140","B.5.A.1.3) Costo del personale dirigente medico - altro",null,"BA2140",{"$f":"SUMIF('00 Aggregatore'!$B:$B,'00 CE'!$E318,'00 Aggregatore'!E:E)","v":0},{"$f":"SUMIF('00 Aggregatore'!$B:$B,'00 CE'!$E318,'00 Aggregatore'!F:F)","v":0}]
[null,"BA2150","B.5.A.2) Costo del personale dirigente non medico","S","BA2150",{"$f":"SUM(F320:F322)","v":5133436.1000000006},{"$f":"SUM(G320:G322)","v":5169414.5299999993}]
[null,"BA2160","B.5.A.2.1) Costo del personale dirigente non medico - tempo indeterminato",null,"BA2160",{"$f":"SUMIF('00 Aggregatore'!$B:$B,'00 CE'!$E320,'00 Aggregatore'!E:E)","v":5069887.5500000007},{"$f":"SUMIF('00 Aggregatore'!$B:$B,'00 CE'!$E320,'00 Aggregatore'!F:F)","v":5064518.01}]
[null,"BA2170","B.5.A.2.2) Costo del personale dirigente non medico - tempo determinato",null,"BA2170",{"$f":"SUMIF('00 Aggregatore'!$B:$B,'00 CE'!$E321,'00 Aggregatore'!E:E)","v":63548.549999999996},{"$f":"SUMIF('00 Aggregatore'!$B:$B,'00 CE'!$E321,'00 Aggregatore'!F:F)","v":104896.52000000002}]
[null,"BA2180","B.5.A.2.3) Costo del personale dirigente non medico - altro",null,"BA2180",{"$f":"SUMIF('00 Aggregatore'!$B:$B,'00 CE'!$E322,'00 Aggregatore'!E:E)","v":0},{"$f":"SUMIF('00 Aggregatore'!$B:$B,'00 CE'!$E322,'00 Aggregatore'!F:F)","v":0}]
[null,"BA2190","B.5.B) Costo del personale comparto ruolo sanitario","S","BA2190",{"$f":"SUM(F324:F326)","v":66021506.56000001},{"$f":"SUM(G324:G326)","v":64856944.969999991}]
[null,"BA2200","B.5.B.1) Costo del personale comparto ruolo sanitario - tempo indeterminato",null,"BA2200",{"$f":"SUMIF('00 Aggregatore'!$B:$B,'00 CE'!$E324,'00 Aggregatore'!E:E)","v":65460246.470000006},{"$f":"SUMIF('00 Aggregatore'!$B:$B,'00 CE'!$E324,'00 Aggregatore'!F:F)","v":64044509.309999995}]
[null,"BA2210","B.5.B.2) Costo del personale comparto ruolo sanitario - tempo determinato",null,"BA2210",{"$f":"SUMIF('00 Aggregatore'!$B:$B,'00 CE'!$E325,'00 Aggregatore'!E:E)","v":561260.09},{"$f":"SUMIF('00 Aggregatore'!$B:$B,'00 CE'!$E325,'00 Aggregatore'!F:F)","v":812435.66}]
[null,"BA2220","B.5.B.3) Costo del personale comparto ruolo sanitario - altro",null,"BA2220",{"$f":"SUMIF('00 Aggregatore'!$B:$B,'00 CE'!$E326,'00 Aggregatore'!E:E)","v":0},{"$f":"SUMIF('00 Aggregatore'!$B:$B,'00 CE'!$E326,'00 Aggregatore'!F:F)","v":0}]
[null,"BA2230","B.6)   Personale del ruolo professionale","S","BA2230",{"$f":"F328+F332","v":451377.58999999997},{"$f":"G328+G332","v":438201.74}]
[null,"BA2240","B.6.A) Costo del personale dirigente ruolo professionale","S","BA2240",{"$f":"SUM(F329:F331)","v":416355.11},{"$f":"SUM(G329:G331)","v":425798.17}]
[null,"BA2250","B.6.A.1) Costo del personale dirigente ruolo professionale - tempo indeterminato",null,"BA2250",{"$f":"SUMIF('00 Aggregatore'!$B:$B,'00 CE'!$E329,'00 Aggregatore'!E:E)","v":343146.87},{"$f":"SUMIF('00 Aggregatore'!$B:$B,'00 CE'!$E329,'00 Aggregatore'!F:F)","v":404674.32}]
[null,"BA2260","B.6.A.2) Costo del personale dirigente ruolo professionale - tempo determinato",null,"BA2260",{"$f":"SUMIF('00 Aggregatore'!$B:$B,'00 CE'!$E330,'00 Aggregatore'!E:E)","v":73208.239999999991},{"$f":"SUMIF('00 Aggregatore'!$B:$B,'00 CE'!$E330,'00 Aggregatore'!F:F)","v":21123.85}]
[null,"BA2270","B.6.A.3) Costo del personale dirigente ruolo professionale - altro",null,"BA2270",{"$f":"SUMIF('00 Aggregatore'!$B:$B,'00 CE'!$E331,'00 Aggregatore'!E:E)","v":0},{"$f":"SUMIF('00 Aggregatore'!$B:$B,'00 CE'!$E331,'00 Aggregatore'!F:F)","v":0}]
[null,"BA2280","B.6.B) Costo del personale comparto ruolo professionale","S","BA2280",{"$f":"SUM(F333:F335)","v":35022.480000000003},{"$f":"SUM(G333:G335)","v":12403.57}]
[null,"BA2290","B.6.B.1) Costo del personale comparto ruolo professionale - tempo indeterminato",null,"BA2290",{"$f":"SUMIF('00 Aggregatore'!$B:$B,'00 CE'!$E333,'00 Aggregatore'!E:E)","v":35022.480000000003},{"$f":"SUMIF('00 Aggregatore'!$B:$B,'00 CE'!$E333,'00 Aggregatore'!F:F)","v":12403.57}]
[null,"BA2300","B.6.B.2) Costo del personale comparto ruolo professionale - tempo determinato",null,"BA2300",{"$f":"SUMIF('00 Aggregatore'!$B:$B,'00 CE'!$E334,'00 Aggregatore'!E:E)","v":0},{"$f":"SUMIF('00 Aggregatore'!$B:$B,'00 CE'!$E334,'00 Aggregatore'!F:F)","v":0}]
[null,"BA2310","B.6.B.3) Costo del personale comparto ruolo professionale - altro",null,"BA2310",{"$f":"SUMIF('00 Aggregatore'!$B:$B,'00 CE'!$E335,'00 Aggregatore'!E:E)","v":0},{"$f":"SUMIF('00 Aggregatore'!$B:$B,'00 CE'!$E335,'00 Aggregatore'!F:F)","v":0}]
[null,"BA2320","B.7)   Personale del ruolo tecnico","S","BA2320",{"$f":"F337+F341","v":16770524.01},{"$f":"G337+G341","v":16516470.15}]
[null,"BA2330","B.7.A) Costo del personale dirigente ruolo tecnico","S","BA2330",{"$f":"SUM(F338:F340)","v":482150.58999999997},{"$f":"SUM(G338:G340)","v":375739.52999999997}]
[null,"BA2340","B.7.A.1) Costo del personale dirigente ruolo tecnico - tempo indeterminato",null,"BA2340",{"$f":"SUMIF('00 Aggregatore'!$B:$B,'00 CE'!$E338,'00 Aggregatore'!E:E)","v":482150.58999999997},{"$f":"SUMIF('00 Aggregatore'!$B:$B,'00 CE'!$E338,'00 Aggregatore'!F:F)","v":375739.52999999997}]
[null,"BA2350","B.7.A.2) Costo del personale dirigente ruolo tecnico - tempo determinato",null,"BA2350",{"$f":"SUMIF('00 Aggregatore'!$B:$B,'00 CE'!$E339,'00 Aggregatore'!E:E)","v":0},{"$f":"SUMIF('00 Aggregatore'!$B:$B,'00 CE'!$E339,'00 Aggregatore'!F:F)","v":0}]
[null,"BA2360","B.7.A.3) Costo del personale dirigente ruolo tecnico - altro",null,"BA2360",{"$f":"SUMIF('00 Aggregatore'!$B:$B,'00 CE'!$E340,'00 Aggregatore'!E:E)","v":0},{"$f":"SUMIF('00 Aggregatore'!$B:$B,'00 CE'!$E340,'00 Aggregatore'!F:F)","v":0}]
[null,"BA2370","B.7.B) Costo del personale comparto ruolo tecnico","S","BA2370",{"$f":"SUM(F342:F344)","v":16288373.42},{"$f":"SUM(G342:G344)","v":16140730.620000001}]
[null,"BA2380","B.7.B.1) Costo del personale comparto ruolo tecnico - tempo indeterminato",null,"BA2380",{"$f":"SUMIF('00 Aggregatore'!$B:$B,'00 CE'!$E342,'00 Aggregatore'!E:E)","v":15879905.449999999},{"$f":"SUMIF('00 Aggregatore'!$B:$B,'00 CE'!$E342,'00 Aggregatore'!F:F)","v":15963506.970000001}]
[null,"BA2390","B.7.B.2) Costo del personale comparto ruolo tecnico - tempo determinato",null,"BA2390",{"$f":"SUMIF('00 Aggregatore'!$B:$B,'00 CE'!$E343,'00 Aggregatore'!E:E)","v":408467.97},{"$f":"SUMIF('00 Aggregatore'!$B:$B,'00 CE'!$E343,'00 Aggregatore'!F:F)","v":177223.65000000002}]
[null,"BA2400","B.7.B.3) Costo del personale comparto ruolo tecnico - altro",null,"BA2400",{"$f":"SUMIF('00 Aggregatore'!$B:$B,'00 CE'!$E344,'00 Aggregatore'!E:E)","v":0},{"$f":"SUMIF('00 Aggregatore'!$B:$B,'00 CE'!$E344,'00 Aggregatore'!F:F)","v":0}]
[null,"BA2410","B.8)   Personale del ruolo amministrativo","S","BA2410",{"$f":"F346+F350","v":10174243.659999998},{"$f":"G346+G350","v":10114311.859999999}]
[null,"BA2420","B.8.A) Costo del personale dirigente ruolo amministrativo","S","BA2420",{"$f":"SUM(F347:F349)","v":787868.7},{"$f":"SUM(G347:G349)","v":824224.55}]
[null,"BA2430","B.8.A.1) Costo del personale dirigente ruolo amministrativo - tempo indeterminato",null,"BA2430",{"$f":"SUMIF('00 Aggregatore'!$B:$B,'00 CE'!$E347,'00 Aggregatore'!E:E)","v":787868.7},{"$f":"SUMIF('00 Aggregatore'!$B:$B,'00 CE'!$E347,'00 Aggregatore'!F:F)","v":824224.55}]
[null,"BA2440","B.8.A.2) Costo del personale dirigente ruolo amministrativo - tempo determinato",null,"BA2440",{"$f":"SUMIF('00 Aggregatore'!$B:$B,'00 CE'!$E348,'00 Aggregatore'!E:E)","v":0},{"$f":"SUMIF('00 Aggregatore'!$B:$B,'00 CE'!$E348,'00 Aggregatore'!F:F)","v":0}]
[null,"BA2450","B.8.A.3) Costo del personale dirigente ruolo amministrativo - altro",null,"BA2450",{"$f":"SUMIF('00 Aggregatore'!$B:$B,'00 CE'!$E349,'00 Aggregatore'!E:E)","v":0},{"$f":"SUMIF('00 Aggregatore'!$B:$B,'00 CE'!$E349,'00 Aggregatore'!F:F)","v":0}]
[null,"BA2460","B.8.B) Costo del personale comparto ruolo amministrativo","S","BA2460",{"$f":"SUM(F351:F353)","v":9386374.959999999},{"$f":"SUM(G351:G353)","v":9290087.3099999987}]
[null,"BA2470","B.8.B.1) Costo del personale comparto ruolo amministrativo - tempo indeterminato",null,"BA2470",{"$f":"SUMIF('00 Aggregatore'!$B:$B,'00 CE'!$E351,'00 Aggregatore'!E:E)","v":9385507.379999999},{"$f":"SUMIF('00 Aggregatore'!$B:$B,'00 CE'!$E351,'00 Aggregatore'!F:F)","v":9288718.9999999981}]
[null,"BA2480","B.8.B.2) Costo del personale comparto ruolo amministrativo - tempo determinato",null,"BA2480",{"$f":"SUMIF('00 Aggregatore'!$B:$B,'00 CE'!$E352,'00 Aggregatore'!E:E)","v":867.58},{"$f":"SUMIF('00 Aggregatore'!$B:$B,'00 CE'!$E352,'00 Aggregatore'!F:F)","v":1368.31}]
[null,"BA2490","B.8.B.3) Costo del personale comparto ruolo amministrativo - altro",null,"BA2490",{"$f":"SUMIF('00 Aggregatore'!$B:$B,'00 CE'!$E353,'00 Aggregatore'!E:E)","v":0},{"$f":"SUMIF('00 Aggregatore'!$B:$B,'00 CE'!$E353,'00 Aggregatore'!F:F)","v":0}]
[null,"BA2500","B.9)   Oneri diversi di gestione","S","BA2500",{"$f":"SUM(F355:F357)","v":2842735.25},{"$f":"SUM(G355:G357)","v":2884146.3600000003}]
[null,"BA2510","B.9.A)  Imposte e tasse (escluso IRAP e IRES)",null,"BA2510",{"$f":"SUMIF('00 Aggregatore'!$B:$B,'00 CE'!$E355,'00 Aggregatore'!E:E)","v":1055569.6099999999},{"$f":"SUMIF('00 Aggregatore'!$B:$B,'00 CE'!$E355,'00 Aggregatore'!F:F)","v":1160574.8}]
[null,"BA2520","B.9.B)  Perdite su crediti",null,"BA2520",{"$f":"SUMIF('00 Aggregatore'!$B:$B,'00 CE'!$E356,'00 Aggregatore'!E:E)","v":0},{"$f":"SUMIF('00 Aggregatore'!$B:$B,'00 CE'!$E356,'00 Aggregatore'!F:F)","v":0}]
[null,"BA2530","B.9.C) Altri oneri diversi di gestione","S","BA2530",{"$f":"SUM(F358:F359)","v":1787165.6400000001},{"$f":"SUM(G358:G359)","v":1723571.56}]
[null,"BA2540","B.9.C.1)  Indennità, rimborso spese e oneri sociali per gli Organi Direttivi e Collegio Sindacale",null,"BA2540",{"$f":"SUMIF('00 Aggregatore'!$B:$B,'00 CE'!$E358,'00 Aggregatore'!E:E)","v":1434574.81},{"$f":"SUMIF('00 Aggregatore'!$B:$B,'00 CE'!$E358,'00 Aggregatore'!F:F)","v":1430687.1400000001}]
[null,"BA2550","B.9.C.2)  Altri oneri diversi di gestione",null,"BA2550",{"$f":"SUMIF('00 Aggregatore'!$B:$B,'00 CE'!$E359,'00 Aggregatore'!E:E)","v":352590.83},{"$f":"SUMIF('00 Aggregatore'!$B:$B,'00 CE'!$E359,'00 Aggregatore'!F:F)","v":292884.42000000004}]
[null,"BA2560","Totale Ammortamenti","S","BA2560",{"$f":"SUM(F361:F362)","v":8977413.9100000001},{"$f":"SUM(G361:G362)","v":10262377.760000002}]
[null,"BA2570","B.10) Ammortamenti delle immobilizzazioni immateriali",null,"BA2570",{"$f":"SUMIF('00 Aggregatore'!$B:$B,'00 CE'!$E361,'00 Aggregatore'!E:E)","v":105301.39},{"$f":"SUMIF('00 Aggregatore'!$B:$B,'00 CE'!$E361,'00 Aggregatore'!F:F)","v":136552.39000000001}]
[null,"BA2580","B.11) Ammortamenti delle immobilizzazioni materiali","S","BA2580",{"$f":"F363+F366","v":8872112.5199999996},{"$f":"G363+G366","v":10125825.370000001}]
[null,"BA2590","B.12) Ammortamento dei fabbricati","S","BA2590",{"$f":"SUM(F364:F365)","v":4970287.05},{"$f":"SUM(G364:G365)","v":4970287.05}]
[null,"BA2600","B.12.A) Ammortamenti fabbricati non strumentali (disponibili)",null,"BA2600",{"$f":"SUMIF('00 Aggregatore'!$B:$B,'00 CE'!$E364,'00 Aggregatore'!E:E)","v":0},{"$f":"SUMIF('00 Aggregatore'!$B:$B,'00 CE'!$E364,'00 Aggregatore'!F:F)","v":0}]
[null,"BA2610","B.12.B) Ammortamenti fabbricati strumentali (indisponibili)",null,"BA2610",{"$f":"SUMIF('00 Aggregatore'!$B:$B,'00 CE'!$E365,'00 Aggregatore'!E:E)","v":4970287.05},{"$f":"SUMIF('00 Aggregatore'!$B:$B,'00 CE'!$E365,'00 Aggregatore'!F:F)","v":4970287.05}]
[null,"BA2620","B.13) Ammortamenti delle altre immobilizzazioni materiali",null,"BA2620",{"$f":"SUMIF('00 Aggregatore'!$B:$B,'00 CE'!$E366,'00 Aggregatore'!E:E)","v":3901825.47},{"$f":"SUMIF('00 Aggregatore'!$B:$B,'00 CE'!$E366,'00 Aggregatore'!F:F)","v":5155538.32}]
[null,"BA2630","B.14) Svalutazione delle immobilizzazioni e dei crediti","S","BA2630",{"$f":"SUM(F368:F369)","v":0},{"$f":"SUM(G368:G369)","v":0}]
[null,"BA2640","B.14.A) Svalutazione delle immobilizzazioni immateriali e materiali",null,"BA2640",{"$f":"SUMIF('00 Aggregatore'!$B:$B,'00 CE'!$E368,'00 Aggregatore'!E:E)","v":0},{"$f":"SUMIF('00 Aggregatore'!$B:$B,'00 CE'!$E368,'00 Aggregatore'!F:F)","v":0}]
[null,"BA2650","B.14.B) Svalutazione dei crediti",null,"BA2650",{"$f":"SUMIF('00 Aggregatore'!$B:$B,'00 CE'!$E369,'00 Aggregatore'!E:E)","v":0},{"$f":"SUMIF('00 Aggregatore'!$B:$B,'00 CE'!$E369,'00 Aggregatore'!F:F)","v":0}]
[null,"BA2660","B.15) Variazione delle rimanenze","S","BA2660",{"$f":"SUM(F371:F372)","v":810888.64},{"$f":"SUM(G371:G372)","v":-1222094.4500000007}]
[null,"BA2670","B.15.A) Variazione rimanenze sanitarie",null,"BA2670",{"$f":"SUMIF('00 Aggregatore'!$B:$B,'00 CE'!$E371,'00 Aggregatore'!E:E)","v":710402.75},{"$f":"SUMIF('00 Aggregatore'!$B:$B,'00 CE'!$E371,'00 Aggregatore'!F:F)","v":-1167703.8400000005}]
[null,"BA2680","B.15.B) Variazione rimanenze non sanitarie",null,"BA2680",{"$f":"SUMIF('00 Aggregatore'!$B:$B,'00 CE'!$E372,'00 Aggregatore'!E:E)","v":100485.89000000006},{"$f":"SUMIF('00 Aggregatore'!$B:$B,'00 CE'!$E372,'00 Aggregatore'!F:F)","v":-54390.610000000037}]
[null,"BA2690","B.16) Accantonamenti dell’esercizio","S","BA2690",{"$f":"F374+F380+F381+F386","v":11914593.91},{"$f":"G374+G380+G381+G386","v":27470627.169999998}]
[null,"BA2700","B.16.A) Accantonamenti per rischi","S","BA2700",{"$f":"SUM(F375:F379)","v":6355427.5899999999},{"$f":"SUM(G375:G379)","v":17301441.66}]
[null,"BA2710","B.16.A.1)  Accantonamenti per cause civili ed oneri processuali",null,"BA2710",{"$f":"SUMIF('00 Aggregatore'!$B:$B,'00 CE'!$E375,'00 Aggregatore'!E:E)","v":2008370.76},{"$f":"SUMIF('00 Aggregatore'!$B:$B,'00 CE'!$E375,'00 Aggregatore'!F:F)","v":9268206.2400000002}]
[null,"BA2720","B.16.A.2)  Accantonamenti per contenzioso personale dipendente",null,"BA2720",{"$f":"SUMIF('00 Aggregatore'!$B:$B,'00 CE'!$E376,'00 Aggregatore'!E:E)","v":665916.56999999995},{"$f":"SUMIF('00 Aggregatore'!$B:$B,'00 CE'!$E376,'00 Aggregatore'!F:F)","v":562892.11}]
[null,"BA2730","B.16.A.3)  Accantonamenti per rischi connessi all'acquisto di prestazioni sanitarie da privato",null,"BA2730",{"$f":"SUMIF('00 Aggregatore'!$B:$B,'00 CE'!$E377,'00 Aggregatore'!E:E)","v":0},{"$f":"SUMIF('00 Aggregatore'!$B:$B,'00 CE'!$E377,'00 Aggregatore'!F:F)","v":4358962}]
[null,"BA2740","B.16.A.4)  Accantonamenti per copertura diretta dei rischi (autoassicurazione)",null,"BA2740",{"$f":"SUMIF('00 Aggregatore'!$B:$B,'00 CE'!$E378,'00 Aggregatore'!E:E)","v":3681140.26},{"$f":"SUMIF('00 Aggregatore'!$B:$B,'00 CE'!$E378,'00 Aggregatore'!F:F)","v":3111381.31}]
[null,"BA2750","B.16.A.5)  Altri accantonamenti per rischi",null,"BA2750",{"$f":"SUMIF('00 Aggregatore'!$B:$B,'00 CE'!$E379,'00 Aggregatore'!E:E)","v":0},{"$f":"SUMIF('00 Aggregatore'!$B:$B,'00 CE'!$E379,'00 Aggregatore'!F:F)","v":0}]
[null,"BA2760","B.16.B) Accantonamenti per premio di operosità (SUMAI)",null,"BA2760",{"$f":"SUMIF('00 Aggregatore'!$B:$B,'00 CE'!$E380,'00 Aggregatore'!E:E)","v":225172.71},{"$f":"SUMIF('00 Aggregatore'!$B:$B,'00 CE'!$E380,'00 Aggregatore'!F:F)","v":223015.56}]
[null,"BA2770","B.16.C) Accantonamenti per quote inutilizzate di contributi vincolati","S","BA2770",{"$f":"SUM(F382:F385)","v":4202172.6100000003},{"$f":"SUM(G382:G385)","v":7068429.9500000002}]
[null,"BA2780","B.16.C.1)  Accantonamenti per quote inutilizzate contributi da Regione e Prov. Aut. per quota F.S. vincolato",null,"BA2780",{"$f":"SUMIF('00 Aggregatore'!$B:$B,'00 CE'!$E382,'00 Aggregatore'!E:E)","v":4021566.65},{"$f":"SUMIF('00 Aggregatore'!$B:$B,'00 CE'!$E382,'00 Aggregatore'!F:F)","v":7018127.5499999998}]
[null,"BA2790","B.16.C.2)  Accantonamenti per quote inutilizzate contributi da soggetti pubblici (extra fondo) vincolati",null,"BA2790",{"$f":"SUMIF('00 Aggregatore'!$B:$B,'00 CE'!$E383,'00 Aggregatore'!E:E)","v":180605.96},{"$f":"SUMIF('00 Aggregatore'!$B:$B,'00 CE'!$E383,'00 Aggregatore'!F:F)","v":50302.400000000001}]
[null,"BA2800","B.16.C.3)  Accantonamenti per quote inutilizzate contributi da soggetti pubblici per ricerca",null,"BA2800",{"$f":"SUMIF('00 Aggregatore'!$B:$B,'00 CE'!$E384,'00 Aggregatore'!E:E)","v":0},{"$f":"SUMIF('00 Aggregatore'!$B:$B,'00 CE'!$E384,'00 Aggregatore'!F:F)","v":0}]
[null,"BA2810","B.16.C.4)  Accantonamenti per quote inutilizzate contributi vincolati da privati",null,"BA2810",{"$f":"SUMIF('00 Aggregatore'!$B:$B,'00 CE'!$E385,'00 Aggregatore'!E:E)","v":0},{"$f":"SUMIF('00 Aggregatore'!$B:$B,'00 CE'!$E385,'00 Aggregatore'!F:F)","v":0}]
[null,"BA2820","B.16.D) Altri accantonamenti","S","BA2820",{"$f":"SUM(F387:F393)","v":1131821},{"$f":"SUM(G387:G393)","v":2877740}]
[null,"BA2830","B.16.D.1)  Accantonamenti per interessi di mora",null,"BA2830",{"$f":"SUMIF('00 Aggregatore'!$B:$B,'00 CE'!$E387,'00 Aggregatore'!E:E)","v":0},{"$f":"SUMIF('00 Aggregatore'!$B:$B,'00 CE'!$E387,'00 Aggregatore'!F:F)","v":0}]
[null,"BA2840","B.16.D.2)  Acc. Rinnovi convenzioni MMG/PLS/MCA",null,"BA2840",{"$f":"SUMIF('00 Aggregatore'!$B:$B,'00 CE'!$E388,'00 Aggregatore'!E:E)","v":407348},{"$f":"SUMIF('00 Aggregatore'!$B:$B,'00 CE'!$E388,'00 Aggregatore'!F:F)","v":653733}]
[null,"BA2850","B.16.D.3)  Acc. Rinnovi convenzioni Medici Sumai",null,"BA2850",{"$f":"SUMIF('00 Aggregatore'!$B:$B,'00 CE'!$E389,'00 Aggregatore'!E:E)","v":48849},{"$f":"SUMIF('00 Aggregatore'!$B:$B,'00 CE'!$E389,'00 Aggregatore'!F:F)","v":82934}]
[null,"BA2860","B.16.D.4)  Acc. Rinnovi contratt.: dirigenza medica",null,"BA2860",{"$f":"SUMIF('00 Aggregatore'!$B:$B,'00 CE'!$E390,'00 Aggregatore'!E:E)","v":278091},{"$f":"SUMIF('00 Aggregatore'!$B:$B,'00 CE'!$E390,'00 Aggregatore'!F:F)","v":757797}]
[null,"BA2870","B.16.D.5)  Acc. Rinnovi contratt.: dirigenza non medica",null,"BA2870",{"$f":"SUMIF('00 Aggregatore'!$B:$B,'00 CE'!$E391,'00 Aggregatore'!E:E)","v":27505},{"$f":"SUMIF('00 Aggregatore'!$B:$B,'00 CE'!$E391,'00 Aggregatore'!F:F)","v":74949}]
[null,"BA2880","B.16.D.6)  Acc. Rinnovi contratt.: comparto",null,"BA2880",{"$f":"SUMIF('00 Aggregatore'!$B:$B,'00 CE'!$E392,'00 Aggregatore'!E:E)","v":370028},{"$f":"SUMIF('00 Aggregatore'!$B:$B,'00 CE'!$E392,'00 Aggregatore'!F:F)","v":1008327}]
[null,"BA2890","B.16.D.7) Altri accantonamenti",null,"BA2890",{"$f":"SUMIF('00 Aggregatore'!$B:$B,'00 CE'!$E393,'00 Aggregatore'!E:E)","v":0},{"$f":"SUMIF('00 Aggregatore'!$B:$B,'00 CE'!$E393,'00 Aggregatore'!F:F)","v":300000}]
[null,"BZ9999","Totale costi della produzione (B)","S","BZ9999",{"$f":"F115+F143+F295+F303+F312+F354+F360+F367+F370+F373","v":694819852.89999998},{"$f":"G115+G143+G295+G303+G312+G354+G360+G367+G370+G373","v":712282553.79999995}]
[null,null,"C)  Proventi e oneri finanziari"]
[null,"CA0010","C.1) Interessi attivi","S","CA0010",{"$f":"SUM(F397:F399)","v":14.16},{"$f":"SUM(G397:G399)","v":0}]
[null,"CA0020","C.1.A) Interessi attivi su c/tesoreria unica",null,"CA0020",{"$f":"SUMIF('00 Aggregatore'!$B:$B,'00 CE'!$E397,'00 Aggregatore'!E:E)","v":0},{"$f":"SUMIF('00 Aggregatore'!$B:$B,'00 CE'!$E397,'00 Aggregatore'!F:F)","v":0}]
[null,"CA0030","C.1.B) Interessi attivi su c/c postali e bancari",null,"CA0030",{"$f":"SUMIF('00 Aggregatore'!$B:$B,'00 CE'!$E398,'00 Aggregatore'!E:E)","v":14.16},{"$f":"SUMIF('00 Aggregatore'!$B:$B,'00 CE'!$E398,'00 Aggregatore'!F:F)","v":0}]
[null,"CA0040","C.1.C) Altri interessi attivi",null,"CA0040",{"$f":"SUMIF('00 Aggregatore'!$B:$B,'00 CE'!$E399,'00 Aggregatore'!E:E)","v":0},{"$f":"SUMIF('00 Aggregatore'!$B:$B,'00 CE'!$E399,'00 Aggregatore'!F:F)","v":0}]
[null,"CA0050","C.2) Altri proventi","S","CA0050",{"$f":"SUM(F401:F405)","v":0},{"$f":"SUM(G401:G405)","v":0}]
[null,"CA0060","C.2.A) Proventi da partecipazioni",null,"CA0060",{"$f":"SUMIF('00 Aggregatore'!$B:$B,'00 CE'!$E401,'00 Aggregatore'!E:E)","v":0},{"$f":"SUMIF('00 Aggregatore'!$B:$B,'00 CE'!$E401,'00 Aggregatore'!F:F)","v":0}]
[null,"CA0070","C.2.B) Proventi finanziari da crediti iscritti nelle immobilizzazioni",null,"CA0070",{"$f":"SUMIF('00 Aggregatore'!$B:$B,'00 CE'!$E402,'00 Aggregatore'!E:E)","v":0},{"$f":"SUMIF('00 Aggregatore'!$B:$B,'00 CE'!$E402,'00 Aggregatore'!F:F)","v":0}]
[null,"CA0080","C.2.C) Proventi finanziari da titoli iscritti nelle immobilizzazioni",null,"CA0080",{"$f":"SUMIF('00 Aggregatore'!$B:$B,'00 CE'!$E403,'00 Aggregatore'!E:E)","v":0},{"$f":"SUMIF('00 Aggregatore'!$B:$B,'00 CE'!$E403,'00 Aggregatore'!F:F)","v":0}]
[null,"CA0090","C.2.D) Altri proventi finanziari diversi dai precedenti",null,"CA0090",{"$f":"SUMIF('00 Aggregatore'!$B:$B,'00 CE'!$E404,'00 Aggregatore'!E:E)","v":0},{"$f":"SUMIF('00 Aggregatore'!$B:$B,'00 CE'!$E404,'00 Aggregatore'!F:F)","v":0}]
[null,"CA0100","C.2.E) Utili su cambi",null,"CA0100",{"$f":"SUMIF('00 Aggregatore'!$B:$B,'00 CE'!$E405,'00 Aggregatore'!E:E)","v":0},{"$f":"SUMIF('00 Aggregatore'!$B:$B,'00 CE'!$E405,'00 Aggregatore'!F:F)","v":0}]
[null,"CA0110","C.3)  Interessi passivi","S","CA0110",{"$f":"SUM(F407:F409)","v":25986.100000000002},{"$f":"SUM(G407:G409)","v":157826.75}]
[null,"CA0120","C.3.A) Interessi passivi su anticipazioni di cassa",null,"CA0120",{"$f":"SUMIF('00 Aggregatore'!$B:$B,'00 CE'!$E407,'00 Aggregatore'!E:E)","v":0},{"$f":"SUMIF('00 Aggregatore'!$B:$B,'00 CE'!$E407,'00 Aggregatore'!F:F)","v":0}]
[null,"CA0130","C.3.B) Interessi passivi su mutui",null,"CA0130",{"$f":"SUMIF('00 Aggregatore'!$B:$B,'00 CE'!$E408,'00 Aggregatore'!E:E)","v":0},{"$f":"SUMIF('00 Aggregatore'!$B:$B,'00 CE'!$E408,'00 Aggregatore'!F:F)","v":0}]
[null,"CA0140","C.3.C) Altri interessi passivi",null,"CA0140",{"$f":"SUMIF('00 Aggregatore'!$B:$B,'00 CE'!$E409,'00 Aggregatore'!E:E)","v":25986.100000000002},{"$f":"SUMIF('00 Aggregatore'!$B:$B,'00 CE'!$E409,'00 Aggregatore'!F:F)","v":157826.75}]
[null,"CA0150","C.4) Altri oneri","S","CA0150",{"$f":"SUM(F411:F412)","v":167.46},{"$f":"SUM(G411:G412)","v":4522.33}]
[null,"CA0160","C.4.A) Altri oneri finanziari",null,"CA0160",{"$f":"SUMIF('00 Aggregatore'!$B:$B,'00 CE'!$E411,'00 Aggregatore'!E:E)","v":167.46},{"$f":"SUMIF('00 Aggregatore'!$B:$B,'00 CE'!$E411,'00 Aggregatore'!F:F)","v":4522.33}]
[null,"CA0170","C.4.B) Perdite su cambi",null,"CA0170",{"$f":"SUMIF('00 Aggregatore'!$B:$B,'00 CE'!$E412,'00 Aggregatore'!E:E)","v":0},{"$f":"SUMIF('00 Aggregatore'!$B:$B,'00 CE'!$E412,'00 Aggregatore'!F:F)","v":0}]
[null,"CZ9999","Totale proventi e oneri finanziari (C)","S","CZ9999",{"$f":"F396+F400-F406-F410","v":-26139.4},{"$f":"G396+G400-G406-G410","v":-162349.07999999999}]
[null,null,"D)  Rettifiche di valore di attività finanziarie"]
[null,"DA0010","D.1)  Rivalutazioni",null,"DA0010",{"$f":"SUMIF('00 Aggregatore'!$B:$B,'00 CE'!$E415,'00 Aggregatore'!E:E)","v":0},{"$f":"SUMIF('00 Aggregatore'!$B:$B,'00 CE'!$E415,'00 Aggregatore'!F:F)","v":0}]
[null,"DA0020","D.2)  Svalutazioni",null,"DA0020",{"$f":"SUMIF('00 Aggregatore'!$B:$B,'00 CE'!$E416,'00 Aggregatore'!E:E)","v":0},{"$f":"SUMIF('00 Aggregatore'!$B:$B,'00 CE'!$E416,'00 Aggregatore'!F:F)","v":0}]
[null,"DZ9999","Totale rettifiche di valore di attività finanziarie (D)","S","DZ9999",{"$f":"+F415-F416","v":0},{"$f":"+G415-G416","v":0}]
[null,null,"E)  Proventi e oneri straordinari"]
[null,"EA0010","E.1) Proventi straordinari","S","EA0010",{"$f":"F420+F421","v":5047654.01},{"$f":"G420+G421","v":9487148.8499999996}]
[null,"EA0020","E.1.A) Plusvalenze",null,"EA0020",{"$f":"SUMIF('00 Aggregatore'!$B:$B,'00 CE'!$E420,'00 Aggregatore'!E:E)","v":0},{"$f":"SUMIF('00 Aggregatore'!$B:$B,'00 CE'!$E420,'00 Aggregatore'!F:F)","v":0}]
[null,"EA0030","E.1.B) Altri proventi straordinari","S","EA0030",{"$f":"F422+F423+F433+F443","v":5047654.01},{"$f":"G422+G423+G433+G443","v":9487148.8499999996}]
[null,"EA0040","E.1.B.1) Proventi da donazioni e liberalità diverse",null,"EA0040",{"$f":"SUMIF('00 Aggregatore'!$B:$B,'00 CE'!$E422,'00 Aggregatore'!E:E)","v":0},{"$f":"SUMIF('00 Aggregatore'!$B:$B,'00 CE'!$E422,'00 Aggregatore'!F:F)","v":0}]
[null,"EA0050","E.1.B.2) Sopravvenienze attive","S","EA0050",{"$f":"F424+F425","v":4749172.09},{"$f":"G424+G425","v":7401259.6999999993}]
[null,"EA0060","E.1.B.2.1) Sopravvenienze attive v/Aziende sanitarie pubbliche della Regione ",null,"EA0060",{"$f":"SUMIF('00 Aggregatore'!$B:$B,'00 CE'!$E424,'00 Aggregatore'!E:E)","v":123928.70000000001},{"$f":"SUMIF('00 Aggregatore'!$B:$B,'00 CE'!$E424,'00 Aggregatore'!F:F)","v":2049452.26}]
[null,"EA0070","E.1.B.2.2) Sopravvenienze attive v/terzi","S","EA0070",{"$f":"SUM(F426:F432)","v":4625243.3899999997},{"$f":"SUM(G426:G432)","v":5351807.4399999995}]
[null,"EA0080","E.1.B.2.2.A) Sopravvenienze attive v/terzi relative alla mobilità extraregionale",null,"EA0080",{"$f":"SUMIF('00 Aggregatore'!$B:$B,'00 CE'!$E426,'00 Aggregatore'!E:E)","v":0},{"$f":"SUMIF('00 Aggregatore'!$B:$B,'00 CE'!$E426,'00 Aggregatore'!F:F)","v":0}]
[null,"EA0090","E.1.B.2.2.B) Sopravvenienze attive v/terzi relative al personale",null,"EA0090",{"$f":"SUMIF('00 Aggregatore'!$B:$B,'00 CE'!$E427,'00 Aggregatore'!E:E)","v":0},{"$f":"SUMIF('00 Aggregatore'!$B:$B,'00 CE'!$E427,'00 Aggregatore'!F:F)","v":0}]
[null,"EA0100","E.1.B.2.2.C) Sopravvenienze attive v/terzi relative alle convenzioni con medici di base",null,"EA0100",{"$f":"SUMIF('00 Aggregatore'!$B:$B,'00 CE'!$E428,'00 Aggregatore'!E:E)","v":0},{"$f":"SUMIF('00 Aggregatore'!$B:$B,'00 CE'!$E428,'00 Aggregatore'!F:F)","v":0}]
[null,"EA0110","E.1.B.2.2.D) Sopravvenienze attive v/terzi relative alle convenzioni per la specialistica",null,"EA0110",{"$f":"SUMIF('00 Aggregatore'!$B:$B,'00 CE'!$E429,'00 Aggregatore'!E:E)","v":0},{"$f":"SUMIF('00 Aggregatore'!$B:$B,'00 CE'!$E429,'00 Aggregatore'!F:F)","v":0}]
[null,"EA0120","E.1.B.2.2.E) Sopravvenienze attive v/terzi relative all'acquisto prestaz. sanitarie da operatori accreditati",null,"EA0120",{"$f":"SUMIF('00 Aggregatore'!$B:$B,'00 CE'!$E430,'00 Aggregatore'!E:E)","v":284856.88},{"$f":"SUMIF('00 Aggregatore'!$B:$B,'00 CE'!$E430,'00 Aggregatore'!F:F)","v":2999852.73}]
[null,"EA0130","E.1.B.2.2.F) Sopravvenienze attive v/terzi relative all'acquisto di beni e servizi",null,"EA0130",{"$f":"SUMIF('00 Aggregatore'!$B:$B,'00 CE'!$E431,'00 Aggregatore'!E:E)","v":302481.96999999997},{"$f":"SUMIF('00 Aggregatore'!$B:$B,'00 CE'!$E431,'00 Aggregatore'!F:F)","v":341295.78}]
[null,"EA0140","E.1.B.2.2.G) Altre sopravvenienze attive v/terzi",null,"EA0140",{"$f":"SUMIF('00 Aggregatore'!$B:$B,'00 CE'!$E432,'00 Aggregatore'!E:E)","v":4037904.54},{"$f":"SUMIF('00 Aggregatore'!$B:$B,'00 CE'!$E432,'00 Aggregatore'!F:F)","v":2010658.93}]
[null,"EA0150","E.1.B.3) Insussistenze attive ","S","EA0150",{"$f":"SUM(F434:F435)","v":298481.91999999998},{"$f":"SUM(G434:G435)","v":2085889.15}]
[null,"EA0160","E.1.B.3.1) Insussistenze attive v/Aziende sanitarie pubbliche della Regione",null,"EA0160",{"$f":"SUMIF('00 Aggregatore'!$B:$B,'00 CE'!$E434,'00 Aggregatore'!E:E)","v":0},{"$f":"SUMIF('00 Aggregatore'!$B:$B,'00 CE'!$E434,'00 Aggregatore'!F:F)","v":0}]
[null,"EA0170","E.1.B.3.2) Insussistenze attive v/terzi","S","EA0170",{"$f":"SUM(F436:F442)","v":298481.91999999998},{"$f":"SUM(G436:G442)","v":2085889.15}]
[null,"EA0180","E.1.B.3.2.A) Insussistenze attive v/terzi relative alla mobilità extraregionale",null,"EA0180",{"$f":"SUMIF('00 Aggregatore'!$B:$B,'00 CE'!$E436,'00 Aggregatore'!E:E)","v":0},{"$f":"SUMIF('00 Aggregatore'!$B:$B,'00 CE'!$E436,'00 Aggregatore'!F:F)","v":0}]
[null,"EA0190","E.1.B.3.2.B) Insussistenze attive v/terzi relative al personale",null,"EA0190",{"$f":"SUMIF('00 Aggregatore'!$B:$B,'00 CE'!$E437,'00 Aggregatore'!E:E)","v":0},{"$f":"SUMIF('00 Aggregatore'!$B:$B,'00 CE'!$E437,'00 Aggregatore'!F:F)","v":0}]
[null,"EA0200","E.1.B.3.2.C) Insussistenze attive v/terzi relative alle convenzioni con medici di base",null,"EA0200",{"$f":"SUMIF('00 Aggregatore'!$B:$B,'00 CE'!$E438,'00 Aggregatore'!E:E)","v":0},{"$f":"SUMIF('00 Aggregatore'!$B:$B,'00 CE'!$E438,'00 Aggregatore'!F:F)","v":0}]
[null,"EA0210","E.1.B.3.2.D) Insussistenze attive v/terzi relative alle convenzioni per la specialistica",null,"EA0210",{"$f":"SUMIF('00 Aggregatore'!$B:$B,'00 CE'!$E439,'00 Aggregatore'!E:E)","v":0},{"$f":"SUMIF('00 Aggregatore'!$B:$B,'00 CE'!$E439,'00 Aggregatore'!F:F)","v":0}]
[null,"EA0220","E.1.B.3.2.E) Insussistenze attive v/terzi relative all'acquisto prestaz. sanitarie da operatori accreditati",null,"EA0220",{"$f":"SUMIF('00 Aggregatore'!$B:$B,'00 CE'!$E440,'00 Aggregatore'!E:E)","v":0},{"$f":"SUMIF('00 Aggregatore'!$B:$B,'00 CE'!$E440,'00 Aggregatore'!F:F)","v":1672403.91}]
[null,"EA0230","E.1.B.3.2.F) Insussistenze attive v/terzi relative all'acquisto di beni e servizi",null,"EA0230",{"$f":"SUMIF('00 Aggregatore'!$B:$B,'00 CE'!$E441,'00 Aggregatore'!E:E)","v":92652.33},{"$f":"SUMIF('00 Aggregatore'!$B:$B,'00 CE'!$E441,'00 Aggregatore'!F:F)","v":288245.17}]
[null,"EA0240","E.1.B.3.2.G) Altre insussistenze attive v/terzi",null,"EA0240",{"$f":"SUMIF('00 Aggregatore'!$B:$B,'00 CE'!$E442,'00 Aggregatore'!E:E)","v":205829.59},{"$f":"SUMIF('00 Aggregatore'!$B:$B,'00 CE'!$E442,'00 Aggregatore'!F:F)","v":125240.07}]
[null,"EA0250","E.1.B.4) Altri proventi straordinari",null,"EA0250",{"$f":"SUMIF('00 Aggregatore'!$B:$B,'00 CE'!$E443,'00 Aggregatore'!E:E)","v":0},{"$f":"SUMIF('00 Aggregatore'!$B:$B,'00 CE'!$E443,'00 Aggregatore'!F:F)","v":0}]
[null,"EA0260","E.2) Oneri straordinari","S","EA0260",{"$f":"F445+F446","v":4804290.8400000008},{"$f":"G445+G446","v":4569599.68}]
[null,"EA0270","E.2.A) Minusvalenze",null,"EA0270",{"$f":"SUMIF('00 Aggregatore'!$B:$B,'00 CE'!$E445,'00 Aggregatore'!E:E)","v":2495.9},{"$f":"SUMIF('00 Aggregatore'!$B:$B,'00 CE'!$E445,'00 Aggregatore'!F:F)","v":0}]
[null,"EA0280","E.2.B) Altri oneri straordinari","S","EA0280",{"$f":"F447+F448+F449+F464+F474","v":4801794.9400000004},{"$f":"G447+G448+G449+G464+G474","v":4569599.68}]
[null,"EA0290","E.2.B.1) Oneri tributari da esercizi precedenti",null,"EA0290",{"$f":"SUMIF('00 Aggregatore'!$B:$B,'00 CE'!$E447,'00 Aggregatore'!E:E)","v":0},{"$f":"SUMIF('00 Aggregatore'!$B:$B,'00 CE'!$E447,'00 Aggregatore'!F:F)","v":0}]
[null,"EA0300","E.2.B.2) Oneri da cause civili ed oneri processuali",null,"EA0300",{"$f":"SUMIF('00 Aggregatore'!$B:$B,'00 CE'!$E448,'00 Aggregatore'!E:E)","v":0},{"$f":"SUMIF('00 Aggregatore'!$B:$B,'00 CE'!$E448,'00 Aggregatore'!F:F)","v":0}]
[null,"EA0310","E.2.B.3) Sopravvenienze passive","S","EA0310",{"$f":"F450+F453","v":3315943.66},{"$f":"G450+G453","v":3545337.7199999997}]
[null,"EA0320","E.2.B.3.1) Sopravvenienze passive v/Aziende sanitarie pubbliche della Regione","S","EA0320",{"$f":"SUM(F451:F452)","v":171427.59},{"$f":"SUM(G451:G452)","v":134078.51}]
[null,"EA0330","E.2.B.3.1.A) Sopravvenienze passive v/Aziende sanitarie pubbliche relative alla mobilità intraregionale",null,"EA0330",{"$f":"SUMIF('00 Aggregatore'!$B:$B,'00 CE'!$E451,'00 Aggregatore'!E:E)","v":82615.08},{"$f":"SUMIF('00 Aggregatore'!$B:$B,'00 CE'!$E451,'00 Aggregatore'!F:F)","v":0}]
[null,"EA0340","E.2.B.3.1.B) Altre sopravvenienze passive v/Aziende sanitarie pubbliche della Regione",null,"EA0340",{"$f":"SUMIF('00 Aggregatore'!$B:$B,'00 CE'!$E452,'00 Aggregatore'!E:E)","v":88812.51},{"$f":"SUMIF('00 Aggregatore'!$B:$B,'00 CE'!$E452,'00 Aggregatore'!F:F)","v":134078.51}]
[null,"EA0350","E.2.B.3.2) Sopravvenienze passive v/terzi","S","EA0350",{"$f":"F454+F455+SUM(F459:F463)","v":3144516.0700000003},{"$f":"G454+G455+SUM(G459:G463)","v":3411259.21}]
[null,"EA0360","E.2.B.3.2.A) Sopravvenienze passive v/terzi relative alla mobilità extraregionale",null,"EA0360",{"$f":"SUMIF('00 Aggregatore'!$B:$B,'00 CE'!$E454,'00 Aggregatore'!E:E)","v":0},{"$f":"SUMIF('00 Aggregatore'!$B:$B,'00 CE'!$E454,'00 Aggregatore'!F:F)","v":0}]
[null,"EA0370","E.2.B.3.2.B) Sopravvenienze passive v/terzi relative al personale","S","EA0370",{"$f":"SUM(F456:F458)","v":864842.55999999994},{"$f":"SUM(G456:G458)","v":551740.16999999993}]
[null,"EA0380","E.2.B.3.2.B.1) Soprav. passive v/terzi relative al personale - dirigenza medica",null,"EA0380",{"$f":"SUMIF('00 Aggregatore'!$B:$B,'00 CE'!$E456,'00 Aggregatore'!E:E)","v":432547.66},{"$f":"SUMIF('00 Aggregatore'!$B:$B,'00 CE'!$E456,'00 Aggregatore'!F:F)","v":183240.74}]
[null,"EA0390","E.2.B.3.2.B.2) Soprav. passive v/terzi relative al personale - dirigenza non medica",null,"EA0390",{"$f":"SUMIF('00 Aggregatore'!$B:$B,'00 CE'!$E457,'00 Aggregatore'!E:E)","v":24961.1},{"$f":"SUMIF('00 Aggregatore'!$B:$B,'00 CE'!$E457,'00 Aggregatore'!F:F)","v":5333.38}]
[null,"EA0400","E.2.B.3.2.B.3) Soprav. passive v/terzi relative al personale - comparto",null,"EA0400",{"$f":"SUMIF('00 Aggregatore'!$B:$B,'00 CE'!$E458,'00 Aggregatore'!E:E)","v":407333.8},{"$f":"SUMIF('00 Aggregatore'!$B:$B,'00 CE'!$E458,'00 Aggregatore'!F:F)","v":363166.05}]
[null,"EA0410","E.2.B.3.2.C) Sopravvenienze passive v/terzi relative alle convenzioni con medici di base",null,"EA0410",{"$f":"SUMIF('00 Aggregatore'!$B:$B,'00 CE'!$E459,'00 Aggregatore'!E:E)","v":90919.59},{"$f":"SUMIF('00 Aggregatore'!$B:$B,'00 CE'!$E459,'00 Aggregatore'!F:F)","v":0}]
[null,"EA0420","E.2.B.3.2.D) Sopravvenienze passive v/terzi relative alle convenzioni per la specialistica",null,"EA0420",{"$f":"SUMIF('00 Aggregatore'!$B:$B,'00 CE'!$E460,'00 Aggregatore'!E:E)","v":0},{"$f":"SUMIF('00 Aggregatore'!$B:$B,'00 CE'!$E460,'00 Aggregatore'!F:F)","v":48576.12}]
[null,"EA0430","E.2.B.3.2.E) Sopravvenienze passive v/terzi relative all'acquisto prestaz. sanitarie da operatori accreditati",null,"EA0430",{"$f":"SUMIF('00 Aggregatore'!$B:$B,'00 CE'!$E461,'00 Aggregatore'!E:E)","v":1108945.43},{"$f":"SUMIF('00 Aggregatore'!$B:$B,'00 CE'!$E461,'00 Aggregatore'!F:F)","v":25282.29}]
[null,"EA0440","E.2.B.3.2.F) Sopravvenienze passive v/terzi relative all'acquisto di beni e servizi",null,"EA0440",{"$f":"SUMIF('00 Aggregatore'!$B:$B,'00 CE'!$E462,'00 Aggregatore'!E:E)","v":964208.68},{"$f":"SUMIF('00 Aggregatore'!$B:$B,'00 CE'!$E462,'00 Aggregatore'!F:F)","v":2651265.85}]
[null,"EA0450","E.2.B.3.2.G) Altre sopravvenienze passive v/terzi",null,"EA0450",{"$f":"SUMIF('00 Aggregatore'!$B:$B,'00 CE'!$E463,'00 Aggregatore'!E:E)","v":115599.81},{"$f":"SUMIF('00 Aggregatore'!$B:$B,'00 CE'!$E463,'00 Aggregatore'!F:F)","v":134394.78}]
[null,"EA0460","E.2.B.4) Insussistenze passive","S","EA0460",{"$f":"SUM(F465:F466)","v":1485851.28},{"$f":"SUM(G465:G466)","v":1024261.96}]
[null,"EA0470","E.2.B.4.1) Insussistenze passive v/Aziende sanitarie pubbliche della Regione",null,"EA0470",{"$f":"SUMIF('00 Aggregatore'!$B:$B,'00 CE'!$E465,'00 Aggregatore'!E:E)","v":0},{"$f":"SUMIF('00 Aggregatore'!$B:$B,'00 CE'!$E465,'00 Aggregatore'!F:F)","v":0}]
[null,"EA0480","E.2.B.4.2) Insussistenze passive v/terzi","S","EA0480",{"$f":"SUM(F467:F473)","v":1485851.28},{"$f":"SUM(G467:G473)","v":1024261.96}]
[null,"EA0490","E.2.B.4.2.A) Insussistenze passive v/terzi relative alla mobilità extraregionale",null,"EA0490",{"$f":"SUMIF('00 Aggregatore'!$B:$B,'00 CE'!$E467,'00 Aggregatore'!E:E)","v":0},{"$f":"SUMIF('00 Aggregatore'!$B:$B,'00 CE'!$E467,'00 Aggregatore'!F:F)","v":0}]
[null,"EA0500","E.2.B.4.2.B) Insussistenze passive v/terzi relative al personale",null,"EA0500",{"$f":"SUMIF('00 Aggregatore'!$B:$B,'00 CE'!$E468,'00 Aggregatore'!E:E)","v":0},{"$f":"SUMIF('00 Aggregatore'!$B:$B,'00 CE'!$E468,'00 Aggregatore'!F:F)","v":0}]
[null,"EA0510","E.2.B.4.2.C) Insussistenze passive v/terzi relative alle convenzioni con medici di base",null,"EA0510",{"$f":"SUMIF('00 Aggregatore'!$B:$B,'00 CE'!$E469,'00 Aggregatore'!E:E)","v":0},{"$f":"SUMIF('00 Aggregatore'!$B:$B,'00 CE'!$E469,'00 Aggregatore'!F:F)","v":0}]
[null,"EA0520","E.2.B.4.2.D) Insussistenze passive v/terzi relative alle convenzioni per la specialistica",null,"EA0520",{"$f":"SUMIF('00 Aggregatore'!$B:$B,'00 CE'!$E470,'00 Aggregatore'!E:E)","v":0},{"$f":"SUMIF('00 Aggregatore'!$B:$B,'00 CE'!$E470,'00 Aggregatore'!F:F)","v":0}]
[null,"EA0530","E.2.B.4.2.E) Insussistenze passive v/terzi relative all'acquisto prestaz. sanitarie da operatori accreditati",null,"EA0530",{"$f":"SUMIF('00 Aggregatore'!$B:$B,'00 CE'!$E471,'00 Aggregatore'!E:E)","v":91.21},{"$f":"SUMIF('00 Aggregatore'!$B:$B,'00 CE'!$E471,'00 Aggregatore'!F:F)","v":832320.62}]
[null,"EA0540","E.2.B.4.2.F) Insussistenze passive v/terzi relative all'acquisto di beni e servizi",null,"EA0540",{"$f":"SUMIF('00 Aggregatore'!$B:$B,'00 CE'!$E472,'00 Aggregatore'!E:E)","v":758.66},{"$f":"SUMIF('00 Aggregatore'!$B:$B,'00 CE'!$E472,'00 Aggregatore'!F:F)","v":115363.27}]
[null,"EA0550","E.2.B.4.2.G) Altre insussistenze passive v/terzi",null,"EA0550",{"$f":"SUMIF('00 Aggregatore'!$B:$B,'00 CE'!$E473,'00 Aggregatore'!E:E)","v":1485001.41},{"$f":"SUMIF('00 Aggregatore'!$B:$B,'00 CE'!$E473,'00 Aggregatore'!F:F)","v":76578.070000000007}]
[null,"EA0560","E.2.B.5) Altri oneri straordinari",null,"EA0560",{"$f":"SUMIF('00 Aggregatore'!$B:$B,'00 CE'!$E474,'00 Aggregatore'!E:E)","v":0},{"$f":"SUMIF('00 Aggregatore'!$B:$B,'00 CE'!$E474,'00 Aggregatore'!F:F)","v":0}]
[null,"EZ9999","Totale proventi e oneri straordinari (E)","S","EZ9999",{"$f":"F419-F444","v":243363.16999999899},{"$f":"G419-G444","v":4917549.17}]
[null,"XA0000","Risultato prima delle imposte (A - B +/- C +/- D +/- E)","s","XA0000",{"$f":"F113-F394+F413+F417+F475","v":-1660086.7899999437},{"$f":"G113-G394+G413+G417+G475","v":-1463013.2999998666}]
[null,null,"Imposte e tasse "]
[null,"YA0010","Y.1) IRAP","S","YA0010",{"$f":"SUM(F479:F482)","v":12177804.770000001},{"$f":"SUM(G479:G482)","v":11656544.959999999}]
[null,"YA0020","Y.1.A) IRAP relativa a personale dipendente",null,"YA0020",{"$f":"SUMIF('00 Aggregatore'!$B:$B,'00 CE'!$E479,'00 Aggregatore'!E:E)","v":11129085.99},{"$f":"SUMIF('00 Aggregatore'!$B:$B,'00 CE'!$E479,'00 Aggregatore'!F:F)","v":10634384.52}]
[null,"YA0030","Y.1.B) IRAP relativa a collaboratori e personale assimilato a lavoro dipendente",null,"YA0030",{"$f":"SUMIF('00 Aggregatore'!$B:$B,'00 CE'!$E480,'00 Aggregatore'!E:E)","v":513866.32},{"$f":"SUMIF('00 Aggregatore'!$B:$B,'00 CE'!$E480,'00 Aggregatore'!F:F)","v":470809.27999999997}]
[null,"YA0040","Y.1.C) IRAP relativa ad attività di libera professione (intramoenia)",null,"YA0040",{"$f":"SUMIF('00 Aggregatore'!$B:$B,'00 CE'!$E481,'00 Aggregatore'!E:E)","v":481354.25},{"$f":"SUMIF('00 Aggregatore'!$B:$B,'00 CE'!$E481,'00 Aggregatore'!F:F)","v":458072.41000000003}]
[null,"YA0050","Y.1.D) IRAP relativa ad attività commerciale",null,"YA0050",{"$f":"SUMIF('00 Aggregatore'!$B:$B,'00 CE'!$E482,'00 Aggregatore'!E:E)","v":53498.21},{"$f":"SUMIF('00 Aggregatore'!$B:$B,'00 CE'!$E482,'00 Aggregatore'!F:F)","v":93278.75}]
[null,"YA0060","Y.2) IRES","S","YA0060",{"$f":"SUM(F484:F485)","v":426818},{"$f":"SUM(G484:G485)","v":490066}]
[null,"YA0070","Y.2.A) IRES su attività istituzionale",null,"YA0070",{"$f":"SUMIF('00 Aggregatore'!$B:$B,'00 CE'!$E484,'00 Aggregatore'!E:E)","v":0},{"$f":"SUMIF('00 Aggregatore'!$B:$B,'00 CE'!$E484,'00 Aggregatore'!F:F)","v":0}]
[null,"YA0080","Y.2.B) IRES su attività commerciale",null,"YA0080",{"$f":"SUMIF('00 Aggregatore'!$B:$B,'00 CE'!$E485,'00 Aggregatore'!E:E)","v":426818},{"$f":"SUMIF('00 Aggregatore'!$B:$B,'00 CE'!$E485,'00 Aggregatore'!F:F)","v":490066}]
[null,"YA0090","Y.3) Accantonamento a F.do Imposte (Accertamenti, condoni, ecc.)",null,"YA0090",{"$f":"SUMIF('00 Aggregatore'!$B:$B,'00 CE'!$E486,'00 Aggregatore'!E:E)","v":0},{"$f":"SUMIF('00 Aggregatore'!$B:$B,'00 CE'!$E486,'00 Aggregatore'!F:F)","v":0}]
[null,"YZ9999","Totale imposte e tasse","S","YZ9999",{"$f":"F478+F483+F486","v":12604622.770000001},{"$f":"G478+G483+G486","v":12146610.959999999}]
[null,"ZZ9999","RISULTATO DI ESERCIZIO","S","ZZ9999",{"$f":"F476-F487","v":-14264709.559999945},{"$f":"G476-G487","v":-13609624.259999866}]

{"sheet":"Tab 50-51","index":3,"n_rows":70,"n_cols":15,"rows_kept":70,"cut":false,"hidden":false,"merged":[[42,10,45,10],[65,2,65,4],[65,6,65,7],[66,2,66,4],[66,6,66,7],[35,6,35,7],[36,6,36,7],[37,6,37,7],[38,6,38,7],[39,6,39,7],[39,2,39,4],[38,2,38,4],[35,2,35,4],[36,2,36,4],[37,2,37,4],[57,6,57,7],[56,6,56,7],[55,6,55,7],[54,6,54,7],[41,6,41,7],[64,2,64,4],[63,2,63,4],[58,2,58,4],[45,2,45,4],[67,6,67,7],[69,0,69,7],[52,2,52,4],[43,2,43,4],[44,2,44,4],[46,2,46,4],[52,6,52,7],[43,6,43,7],[44,6,44,7],[46,6,46,7],[50,6,50,7],[51,6,51,7],[50,2,50,4],[51,2,51,4],[62,6,62,7],[63,6,63,7],[64,6,64,7],[53,6,53,7],[60,6,60,7],[59,6,59,7],[58,6,58,7],[49,6,49,7],[49,2,49,4],[47,2,47,4],[31,2,31,4],[33,2,33,4],[32,2,32,4],[48,2,48,4],[67,2,67,4],[59,2,59,4],[60,2,60,4],[62,2,62,4],[53,2,53,4],[54,2,54,4],[55,2,55,4],[56,2,56,4],[57,2,57,4],[61,2,61,4],[32,6,32,7],[33,6,33,7],[34,2,34,4],[34,6,34,7],[42,2,42,4],[41,2,41,4],[42,6,42,7],[40,6,40,7],[40,2,40,4],[45,6,45,7],[47,6,47,7],[48,6,48,7],[0,0,0,10],[2,1,2,10],[3,0,4,0],[3,1,4,1],[3,2,4,2],[3,3,4,3],[3,4,4,4],[3,5,4,10],[10,6,12,7],[10,9,12,9],[10,10,12,10],[10,0,12,0],[10,1,12,1],[10,5,12,5],[10,8,12,8],[10,2,12,4],[5,5,5,10],[6,5,6,10],[7,5,7,10],[26,6,26,7],[27,6,27,7],[23,2,23,4],[23,6,23,7],[20,10,23,10],[27,10,30,10],[19,2,19,4],[19,6,19,7],[17,10,18,10],[14,2,18,4],[14,6,18,7],[14,8,18,8],[14,9,16,9],[14,10,16,10],[17,9,18,9],[14,5,18,5],[14,0,18,0],[14,1,18,1],[13,2,13,4],[13,6,13,7],[61,6,61,7],[30,6,30,7],[24,6,24,7],[25,6,25,7],[28,6,28,7],[20,2,20,4],[21,2,21,4],[21,6,21,7],[20,6,20,7],[22,6,22,7],[22,2,22,4],[24,2,24,4],[25,2,25,4],[30,2,30,4],[26,2,26,4],[27,2,27,4],[28,2,28,4],[29,2,29,4],[29,6,29,7],[31,6,31,7]]}
["17.     Contributi in conto esercizio"]
[]
[null,"Tab. 50 – Dettagli contributi in conto esercizio"]
["CODICE MOD. CE","CONTRIBUTI IN C/ESERCIZIO","Quota Capitaria","Funzioni","Altro","Note"]
[null,null,null,null,null,null,null,null,null,null,null,null,"VALORE CE","Diff","Ctrl"]
["AA0030","Contributi da Regione o Prov. Aut. per quota F.S. regionale indistinto",535837429.24000001,11928457.369999999,0,null,null,null,null,null,null,null,{"$error":"#VALUE!"},{"$f":"(C6+D6+E6)-M6","v":{"$error":"#VALUE!"}},{"$f":"IF(N6=0,\"OK\",\" CTRL\")","v":{"$error":"#VALUE!"}}]
["AA0080","Contributi da Regione o Prov. Aut. (extra fondo) - Risorse aggiuntive da bilancio regionale a titolo di copertura LEA",0,0,0,null,null,null,null,null,null,null,{"$error":"#VALUE!"},{"$f":"(C7+D7+E7)-M7","v":{"$error":"#VALUE!"}},{"$f":"IF(N7=0,\"OK\",\" CTRL\")","v":{"$error":"#VALUE!"}}]
["AA0090","Contributi da Regione o Prov. Aut. (extra fondo) - Risorse aggiuntive da bilancio regionale a titolo di copertura extra LEA",0,0,0,null,null,null,null,null,null,null,{"$error":"#VALUE!"},{"$error":"#VALUE!"},{"$error":"#VALUE!"}]
[]
[null,"Tab. 51 – Informativa contributi in conto esercizio"]
["CODICE MOD. CE","DETTAGLIO CONTRIBUTI IN C/ESERCIZIO","Atto",null,null,"Data","Oggetto",null,"Importo assegnato","Importo utilizzato","Codice\nconto"]
[]
[]
["AA0020","DA REGIONE O P.A. PER QUOTA F.S. REGIONALE:",null,null,null,null,null,null,{"$f":"I15+I20","v":562581352.20000005}]
["AA0030","Quota F.S. regionale - indistinto","Delibera di Giunta Regionale in corso di adozione - Nota prot. n.RA/0108087/DPF012  del 13 aprile 2018 \"Linee guida alla redazione del bilancio d'esercizio al 31/12/2017\"",null,null,"2018-04-13","Riparto delle disponibilità finanaziarie per il SSR anno 2017 a favore delle ASL e della GSA presso la Regione",null,{"$f":"535837429.24+11928457.37","v":547765886.61000001},null,"03.01.01.01.01"]
[]
[]
[null,null,null,null,null,null,null,null,null,null,"03.01.01.01.02"]
[]
["AA0040","Quota F.S. regionale - vincolato:",null,null,null,null,null,null,{"$f":"SUM(I21:I24)","v":14815465.590000002}]
[null,"Rimborso farmaci innovativi - Obiettivi PSN","Nota prot. n. RA/0108087/DPF012",null,null,"2018-04-13","Decreto 9 Ottobre 2015, art. 2, comma 3 (G.U. n. 264del 12/11/2015) Rimborso alle Regioni per l'acquisto di farmaci innovativi - Obiettivi PSN",null,3846894,null,"03.01.01.02.12"]
[null,"Rimborso farmaci innovativi oncologici - Obiettivi PSN","Nota prot. n. RA/0108087/DPF012",null,null,"2018-04-13","Decreto 9 Ottobre 2015, art. 2, comma 3 (G.U. n. 264del 12/11/2015) Rimborso alle Regioni per l'acquisto di farmaci innovativi oncologici - Obiettivi PSN",null,3950444.04]
[null,"Obiettivi di Piano 2017 art. 11 cc. 34 e 34bis L. 662/96","DGR n. 92",null,null,"2018-02-20","Obiettivi di Piano 2017",null,5438713.4000000004]
[null,"Obiettivi di Piano 2017 art. 11 cc. 34 e 34bis L. 662/96","DPF010/27",null,null,"2017-12-21","Obiettivi di Piano 2017 Prevenzione",null,1579414.15]
[]
["AA0050","EXTRA FONDO:",null,null,null,null,null,null,{"$f":"I27+I39+I42","v":279788.34999999998}]
["AA0070","Contributi da Regione o Prov. Aut. (extra fondo) vincolati:",null,null,null,null,null,null,{"$f":"SUM(I28:I32)","v":123104.1}]
[null,"Finanziamento 2017 Consultori familiari","DPF015/33",null,null,"2017-07-21","Consultori familiari 2017 - DGR n. 384 del 14/07/2017",null,84952.46,71881.7,"03.01.02.01.01"]
[null,"Finanziamento 2017 Consultori familiari","DPF015/33",null,null,"2017-07-21","Formazione personale consultori familiari 2017 - DGR n. 384 del 14/07/2017",null,7500,920]
[null,"Formazione operatori servizi veterinari","DPF011/162",null,null,"2017-10-20","Formazione e aggiornamento operatori Dipartimento di Prevenzione Servizi Veterinari",null,29221.279999999999,0]
[null,"Banca dati e anagrafe del bestiame","DPF011/172",null,null,"2017-11-14","Banca dati e anagrafe del bestiame",null,1430.36,0]
[]
["AA0080","Contributi da Regione o Prov. Aut. (extra fondo) - \nRisorse aggiuntive da bilancio regionale a titolo di copertura LEA",null,null,null,null,null,null,0]
["AA0090","Contributi da Regione o Prov. Aut. (extra fondo) - \nRisorse aggiuntive da bilancio regionale a titolo di copertura extra LEA",null,null,null,null,null,null,0]
["AA0100","Contributi da Regione o Prov. Aut. (extra fondo) - Altro",null,null,null,null,null,null,0]
["AA0120","Contributi da Aziende sanitarie pubbliche della Regione o Prov. Aut. (extra fondo) vincolati:",null,null,null,null,null,null,0]
[null,"Progetto 1",null,null,null,null,null,null,0]
[null,"Progetto ….",null,null,null,null,null,null,0]
["AA0130","Contributi da Aziende sanitarie pubbliche (extra fondo) altro:",null,null,null,null,null,null,{"$f":"SUM(I40)","v":0}]
[null,"Progetto 1",null,null,null,null,null,null,0]
[null,"Progetto ….",null,null,null,null,null,null,0]
["AA0150","Contributi da altri soggetti pubblici (extra fondo) vincolati:",null,null,null,null,null,null,{"$f":"SUM(I43:I46)","v":156684.25}]
[null,"Contributi modifica strumenti di guida e autoveicoli privati - anno 2016 ","DPF006/05",null,null,"2017-05-15","Modifica strumenti di guida e autoveicoli privati - anno 2016",null,10694.8,10694.8,"03.01.02.03.06"]
[null,"Contributi in favore dei portatori di grave disabilità psichica e motoria - LR 29/2006 anno 2016","DPF013/111",null,null,"2017-11-14","Contributi in favore dei portatori di grave disabilità psichica e motoria - LR 29/2006 anno 2016",null,9669.84,9669.84]
[null,"Accertamenti medico-legali personale scolastico assente per malattia - 2015","DPF015/72",null,null,"2017-12-06","Accertamenti medico-legali personale scolastico assente per malattia - 2015",null,117287.91,117287.91]
[null,"Accertamenti medico-legali personale scolastico assente per malattia - 2017","DPF015/04",null,null,"2018-01-19","Accertamenti medico-legali personale scolastico assente per malattia - 2017",null,19031.7,19031.7]
["AA0160","Contributi da altri soggetti pubblici (extra fondo) L.210/92:",null,null,null,null,null,null,0]
["AA0170","Contributi da altri soggetti pubblici (extra fondo) altro:",null,null,null,null,null,null,0]
[null,"….",null,null,null,null,null,null,0]
[null,"….",null,null,null,null,null,null,0]
[null,null,null,null,null,null,null,null,0]
[null,"PER RICERCA:",null,null,null,null,null,null,0]
["AA0190","Contributi da Ministero della Salute per ricerca corrente:",null,null,null,null,null,null,0]
[null,"….",null,null,null,null,null,null,0]
[null,"….",null,null,null,null,null,null,0]
["AA0200","Contributi da Ministero della Salute per ricerca finalizzata:",null,null,null,null,null,null,0]
[null,"Progetto ….",null,null,null,null,null,null,0]
[null,"Progetto ….",null,null,null,null,null,null,0]
["AA0210","Contributi da Regione ed altri soggetti pubblici per ricerca:",null,null,null,null,null,null,0]
[null,"….",null,null,null,null,null,null,0]
[null,"….",null,null,null,null,null,null,0]
["AA0220","Contributi da privati per ricerca:",null,null,null,null,null,null,0]
[null,"….",null,null,null,null,null,null,0]
[null,"….",null,null,null,null,null,null,0]
[]
["AA0230","CONTRIBUTI DA PRIVATI:",null,null,null,null,null,null,0]
[null,"….",null,null,null,null,null,null,0]
[null,"….",null,null,null,null,null,null,0]
[]
["TOTALE CONTRIBUTI IN C/ESERCIZIO",null,null,null,null,null,null,null,{"$f":"I14+I26","v":562861140.55000007}]

{"sheet":"Dettaglio voce AA0280","index":4,"n_rows":27,"n_cols":5,"rows_kept":27,"cut":false,"hidden":false,"merged":[[22,0,22,2],[1,0,1,3],[16,0,17,0],[16,1,17,1]]}
[]
["Dettaglio somme vincolate anni precedenti rilevate nella voce AA0280"]
[]
[]
[]
["Descrizione somma vincolata","Anno di competenza","Estremi Provvedimento","Importo (in €)"]
["Prevenzione e assistenza detenuti tossicodipendenti - Acconto 2015 - D. Lgs. n. 230/1999",2015,"DPF015/39 del 31/08/2017",37833.599999999999]
["Prevenzione e assistenza detenuti tossicodipendenti - Saldo 2015 - D. Lgs. n. 230/1999",2015,"DPF015/50 del 05/10/2017",9458.4]
["Prevenzione e assistenza detenuti tossicodipendenti - Acconto 2016 - D. Lgs. n. 230/1999",2016,"DPF015/46 del 21/09/2017",37833.599999999999]
["Prevenzione e assistenza detenuti tossicodipendenti - Saldo 2016 - D. Lgs. n. 230/1999",2016,"DPF015/52 del 18/10/2017",9458.4]
["Sanità penitenziaria Acconto 2016",2016,"DPF015/36 del 02/08/2017",609546.18000000005]
["Quota vincolata extracomunitari irregolari D. Lgs. n. 286/1998 - FSR 2014",2014,"DPF015/49 del 23/10/2017",97702.88]
["Quota vincolata extracomunitari irregolari D. Lgs. n. 286/1998 - FSR 2015",2015,"DPF015/51 del 18/10/2017 ",93020.01]
["Quota vincolata extracomunitari irregolari D. Lgs. n. 286/1998 - FSR 2016",2016,"DPF015/65 del 13/11/2017",90045.97]
["Obiettivi di piano 2010",2010,"DGR N. 655 del 31/08/2010",57512.19,"a"]
["Obiettivi di piano 2011",2011,"DGR n. 412 del 15/06/2011",195749.09,"a"]
["Obiettivi di Piano 2012",2012,"DGR n. 8 del 14/01/2013 ",1008130,"a"]
[null,null,"DGR n. 8 del 14/01/2013 - Piano Regionale Prevenzione 2010-2013 DG20/42 del 06/09/2013 - Nota prot. n. 2324/DP del 01/02/2018",1833121.5,"a"]
["Obiettivi di Piano 2013",2013,"DGR n. 269 del 14/04/2014",726388.79,"a"]
["Obiettivi di Piano 2014",2014,"DGR n. 812 del 29/09/2015",936395,"a"]
["Obiettivi di Piano 2015",2015,"DGR n. 178 del 22/03/2016",61076.75,"a"]
[null,null,"Imputazione quota utilizzo 2017 Progetti Obiettivo per acquisto cespiti",-122252.5]
["TOTALE",null,null,{"$f":"SUM(D7:D22)","v":5681019.8600000003}]
[]
[]
[]
["Somma a     Totale utilizzi contributi da Regione per quota FS vincolato",null,null,{"$f":"SUM(D15:D21)","v":4818373.32},"in accordo con Tabella 36"]

{"sheet":"Tab 52","index":5,"n_rows":22,"n_cols":5,"rows_kept":22,"cut":false,"hidden":false,"merged":[[20,0,21,1],[20,2,21,2],[20,3,21,3],[9,0,9,4],[10,1,11,1],[13,1,13,2],[19,0,19,1],[19,2,19,3],[19,4,19,5],[20,4,20,5],[21,4,21,5]]}
[null,"Tab. 52 – Dettaglio rettifica contributi in conto esercizio per destinazione ad investimenti"]
["CODICE MOD. CE","DETTAGLIO RETTIFICA CONTRIBUTI C/ESERCIZIO\nPER DESTINAZIONE AD INVESTIMENTI","Contributo\nassegnato","Quota destinata ad investimenti","Incidenza %"]
["AA0020","Contributi in c/esercizio da Regione o P.A. per quota F.S. regionale",562581352.20000005,6506318.8899999997,{"$f":"D3/C3","v":1.1565116519693983E-2}]
["AA0060","Contributi in c/esercizio da Regione o P.A. extra fondo",123104.1,0,{"$f":"D4/C4","v":0}]
["AA0110","Contributi in c/esercizio da aziende sanitarie pubbliche (extra fondo)",0,0]
["AA0180","Contributi in c/esercizio per ricerca",0,0]
["AA0230","Contributi in c/esercizio da privati",0,0]
[null,"Totale ",{"$f":"SUM(C3:C7)","v":562704456.30000007},{"$f":"SUM(D3:D7)","v":6506318.8899999997},{"$f":"D8/C8","v":1.1562586393542303E-2}]
[]
["L'importo 2017 della \"Rettifica contributi in c/esercizio per destinazione ad investimenti - da Regione o Provincia Autonoma per quota F.S. Regionale vicolato\" è così determinato:"]
[null,"Descrizione","A","B","A*B"]
[null,null,"% Rettifica","Investimenti","Importo"]
[null,"Rettifica contributi FSR per acquisto beni anno 2017",1,6506318.8899999997,{"$f":"C13*D13","v":6506318.8899999997}]
[null,"TOTALE",null,{"$f":"SUM(D13:D13)","v":6506318.8899999997},{"$f":"SUM(E13:E13)","v":6506318.8899999997}]
[]
[]
[]
[]
["Altre informazioni relative a contributi in conto esercizio"]
["Informazione",null,"Caso presente in azienda?",null,"Se sì, illustrare"]
["CT01. Sono state rilevate significative variazioni rispetto all'esercizio precedente?",null,"SI",null,"L'ammontare dei contribuiti in c/esercizio (voce A1 del Conto Economico ex D.Lgs. 118/2011) subisce, rispetto al 2016, un incremento di circa €/mln 10. "]
[null,null,null,null,"Tale aumento è dovuto essenzialmente alle maggiori somme assegnate nell'esercizio 2017 come Obiettivi di PSN per rimborso di farmaci innovativi (€/000 3.847) e di rimborso di farmaci innovativi oncologici (€/000 3.950), rispetto a quelle assegnate nel 2016 (€/000 2.062).  Nel 2017 risultano maggiori rispetto al 2016, per circa €/000 3.000, anche le assegnazioni per Obiettivi di Piano 2017 (DGR n. 92/2018) e per il Piano della prevenzione. "]

{"sheet":"Tab 52bis","index":6,"n_rows":37,"n_cols":2,"rows_kept":37,"cut":false,"hidden":false,"merged":[[3,0,3,1],[5,0,5,1],[17,0,17,1]]}
[]
[]
[]
["Ricavi e sopravvenienze per Payback consuntivo 2017"]
[]
["PAY-BACK 2017\nVOCE CE AA0920 \"Ulteriore Pay-back\"\nVOCE PDC 03.04.05.01.03"]
["DETERMINAZIONI","ASL 203"]
["Determina AIFA n. 1525/2015 Procedura di payback (art. 9-ter, commi nn.10, lett. B) e 11 del D.L. n. 78/2015, convertito con modificazioni dalla L. n. 125/2015, anni 2015-2016-2017)  \n(DPF003/154 del 07.12.2017) ",470558.25]
["Determinazione AIFA del 29 settembre 2006 concernente “Manovra per il governo della spesa farmaceutica convenzionata e non convenzionata: Trasferimento da parte delle Aziende farmaceutiche delle somme dovute a titolo diPAY BACK- SPECIALITA' MEDICINALI VARIE' “ \n(DPF003/155 del 07.12.2017)",67037.820000000007]
["Determinazione AIFA del 29 settembre 2006 concernente “Manovra per il governo della spesa farmaceutica convenzionata e non convenzionata: Trasferimento da parte delle Aziende farmaceutiche delle somme dovute a titolo diPAY BACK- SPECIALITA' MEDICINALI VARIE' “ \n(DPF003/183 del 29.12.2017) liquidata e pagata con DPF003/21 del 19/02/2018",315041.23]
["Determinazione AIFA del 29 settembre 2006 concernente “Manovra per il governo della spesa farmaceutica convenzionata e non convenzionata: Trasferimento da parte delle Aziende farmaceutiche delle somme dovute a titolo diPAY BACK- SPECIALITA' MEDICINALI VARIE' “ \n(DPF003/159 del 07.12.2017)",7523.1]
["Determinazione AIFA del 29 settembre 2006 concernente “Manovra per il governo della spesa farmaceutica convenzionata e non convenzionata: Trasferimento da parte delle Aziende farmaceutiche delle somme dovute a titolo diPAY BACK- SPECIALITA' MEDICINALI VARIE' “ \n(DPF003/111 del 04.10.2017)",1109521.06]
["Sconto 1,83% I° semestre 2017impegnato con DPF003/185  del 29/12/2017  (Rettificata con nota prot. RA/0000/18 del 29/01/2018) e liquidato e pagato con DPF003/13 del 08/02/2018. ",620591.31999999995]
["Pay Back 5%impegnato con DPF003/184 del 29/12/2017 (Rettificata con nota prot. RA/0024712/18 del 29/01/2018) e liquidato e pagato con DPF003/12 del 08/02/2018.",836659.62]
["Totale voce CE AA0920",{"$f":"SUM(B8:B14)","v":3426932.4}]
[]
[]
["SOPRAVVENIENZE ATTIVE 2017 SU PAY-BACK 2016\nVOCE CE EA0140 \"Altre sopravvenienze attive v/terzi\"\nVOCE PDC 06.01.02.02.10"]
["DETERMINAZIONI","ASL 203"]
["I semestre 2016 PB 1,83% (DPF003/158del 07.12.2017)     ",3902.66]
["II semestre 2016 PB 1,83% (DPF003/157del 07.12.2017)     ",523381.49]
["Anno 2016 PB 5% (territoriale)  (DPF003/110 del 04.10.2017)",536783.47]
["Anno 2016 PB 5% ospedaliera)  (DPF003/110 del 04.10.2017)",532712.25]
["Totale Sopravvenienze Attive 2017 su pay back 2016",{"$f":"SUM(B20:B23)","v":1596779.87}]
[]
[]
["I Ricavi per Pay-back 2017 sono stati contabilizzati nella voce CE AA0920 \"Ulteriore Pay-Back\" "]
["secondo gli importi comunicati dalla Regione nelle Linee Guida alla redazione del Bilancio"]
[" di Esercizio 2017 (Nota prot. n. RA/0108087/DPF012 del 13/04/2018 - Allegato 4)."]
[]
["Le Sopravvenienze attive 2017 su Pay-back 2016 sono state contabilizzate nella voce CE EA0140"]
["\"Altre Sopravvenienze attive v/terzi\" secondo gli importi comunicati dalla Regione nelle Linee "]
[" Guida alla redazione del Bilancio di Esercizio 2017 (Nota prot. n. RA/0108087/DPF012  "]
["del 13/04/2018 - Allegato 4)."]
[]
["Non sono stati iscritti nel 2017 ulteriori importi rispetto a quelli comunicati dalla Regione nelle"]
["Linee Guida alla redazione del Bilancio di Esercizio 2017."]

{"sheet":"Tab 53","index":7,"n_rows":61,"n_cols":13,"rows_kept":61,"cut":false,"hidden":false,"merged":[[42,0,43,8],[0,0,0,6],[2,1,2,6],[3,0,4,0],[3,1,4,1],[3,2,3,4],[3,5,3,7],[60,0,64,7],[57,3,57,5],[46,0,46,2],[48,3,51,3],[53,3,54,3],[55,0,55,1]]}
["18.     Proventi e ricavi diversi"]
[]
[null,"Tab. 53 – Dettaglio ricavi per prestazioni sanitarie in mobilità"]
["CODICE MOD. CE","DETTAGLIO RICAVI PER PRESTAZIONI SANITARIE IN MOBILITA'","PUBBLICO",null,null,"PRIVATO",null,null,"TOTALE"]
[null,null,"Avezzano-Sulmona-L'Aquila","Lanciano-Vasto-Chieti","Teramo","Avezzano-Sulmona-L'Aquila","Lanciano-Vasto-Chieti","Teramo",null,null,"VALORE CE","Diff","Ctrl"]
[null," RICAVI DA MOBILITA' SANITARIA INFRAREGIONALE (A)",{"$f":"SUM(C7:C15)","v":10739191.400000002},28931356.859999996,11996328.530000001,4716544.5600000005,29233452.470000003,11064185.680000002,{"$f":"I7+I8+I9+I10+I11+I12+I13+I14+I15","v":96681059.590000018},null,{"$f":"SUM(K7:K18)","v":96681059.590000018}]
["AA0350","Prestazioni di ricovero",6684047.3200000003,17388920.82,6512778.21,2351313.04,21249640.68,7923237.2400000002,{"$f":"SUMIF('00 CE'!B:B,'Tab 53'!A7,'00 CE'!G:G)","v":62109937.310000002},null,{"$f":"SUMIF('00 CE'!B:B,'Tab 53'!A7,'00 CE'!G:G)","v":62109937.310000002},{"$f":"I7-K7","v":0},{"$f":"IF(L7=0,\"OK\",\" CTRL\")","v":"OK"}]
["AA0360","Prestazioni di specialistica ambulatoriale",1298850,2977293,1475181,86247.35,1324740.27,1026202.55,{"$f":"SUMIF('00 CE'!B:B,'Tab 53'!A8,'00 CE'!G:G)","v":8188514.2599999998},null,{"$f":"SUMIF('00 CE'!B:B,'Tab 53'!A8,'00 CE'!G:G)","v":8188514.2599999998},{"$f":"I8-K8","v":0},{"$f":"IF(L8=0,\"OK\",\" CTRL\")","v":"OK"}]
["AA0370","Prestazioni di psichiatria residenziale e semiresidenziale",0,0,0,669606.37,3043960.6,842930.34,{"$f":"SUMIF('00 CE'!B:B,'Tab 53'!A9,'00 CE'!G:G)","v":4556497.3099999996},null,{"$f":"SUMIF('00 CE'!B:B,'Tab 53'!A9,'00 CE'!G:G)","v":4556497.3099999996},0,"OK"]
["AA0380","Prestazioni di File F",2405948.2999999998,7603710.0599999996,3556031.66,0,0,0,{"$f":"SUMIF('00 CE'!B:B,'Tab 53'!A10,'00 CE'!G:G)","v":13565690.02},null,{"$f":"SUMIF('00 CE'!B:B,'Tab 53'!A10,'00 CE'!G:G)","v":13565690.02},0,"OK"]
["AA0390","Prestazioni servizi MMG, PLS, Contin. assistenziale",15422.05,28207.27,13826.33,0,0,0,{"$f":"SUMIF('00 CE'!B:B,'Tab 53'!A11,'00 CE'!G:G)","v":57455.65},null,{"$f":"SUMIF('00 CE'!B:B,'Tab 53'!A11,'00 CE'!G:G)","v":57455.65},0,"OK"]
["AA0400","Prestazioni servizi farmaceutica convenzionata",305702.33,825360.65,399944.28,0,0,0,{"$f":"SUMIF('00 CE'!B:B,'Tab 53'!A12,'00 CE'!G:G)","v":1531007.26},null,{"$f":"SUMIF('00 CE'!B:B,'Tab 53'!A12,'00 CE'!G:G)","v":1531007.26},0,"OK"]
["AA0410","Prestazioni termali",0,0,0,278371.90000000002,659800.01,165927.98000000001,{"$f":"SUMIF('00 CE'!B:B,'Tab 53'!A13,'00 CE'!G:G)","v":1104099.8899999999},null,{"$f":"SUMIF('00 CE'!B:B,'Tab 53'!A13,'00 CE'!G:G)","v":1104099.8899999999},0,"OK"]
["AA0420","Prestazioni trasporto ambulanze ed elisoccorso",29221.4,107865.06,38567.050000000003,0,0,0,{"$f":"SUMIF('00 CE'!B:B,'Tab 53'!A14,'00 CE'!G:G)","v":175653.51},null,{"$f":"SUMIF('00 CE'!B:B,'Tab 53'!A14,'00 CE'!G:G)","v":175653.51},0,"OK"]
["AA0430","Altre prestazioni sanitarie e socio-sanitarie",0,0,0,1331005.8999999999,2955310.91,1105887.57,{"$f":"SUMIF('00 CE'!B:B,'Tab 53'!A15,'00 CE'!G:G)","v":5392204.3799999999},null,{"$f":"SUMIF('00 CE'!B:B,'Tab 53'!A15,'00 CE'!G:G)","v":5392204.3799999999},0,"OK"]
[]
[null," RICAVI DA MOBILITA' SANITARIA EXTRAREGIONALE (B)",{"$f":"SUM(C18:C28)","v":0},0,0,0,0,0,{"$f":"I18+I19+I20+I21+I22+I23+I24+I25+I26+I27+I28","v":5492308.6299999999}]
["AA0460","Prestazioni di ricovero",null,null,null,null,null,null,{"$f":"SUMIF('00 CE'!B:B,'Tab 53'!A18,'00 CE'!G:G)","v":1554681.22}]
["AA0470","Prestazioni di specialistica ambulatoriale",null,null,null,null,null,null,{"$f":"SUMIF('00 CE'!B:B,'Tab 53'!A19,'00 CE'!G:G)","v":851774.85}]
["AA0480","Prestazioni di psichiatria residenziale e semiresidenziale",null,null,null,null,null,null,{"$f":"SUMIF('00 CE'!B:B,'Tab 53'!A20,'00 CE'!G:G)","v":0},null,null,null,2024793]
["AA0490","Prestazioni di File F",null,null,null,null,null,null,{"$f":"SUMIF('00 CE'!B:B,'Tab 53'!A21,'00 CE'!G:G)","v":1604980.14},null,null,null,111766.26]
["AA0500","Prestazioni servizi MMG, PLS, Contin. assistenziale",null,null,null,null,null,null,{"$f":"SUMIF('00 CE'!B:B,'Tab 53'!A22,'00 CE'!G:G)","v":119388.84}]
["AA0510","Prestazioni servizi farmaceutica convenzionata",null,null,null,null,null,null,{"$f":"SUMIF('00 CE'!B:B,'Tab 53'!A23,'00 CE'!G:G)","v":502038.11},null,null,null,{"$f":"SUM(M20:M22)","v":2136559.2599999998}]
["AA0520","Prestazioni termali",null,null,null,null,null,null,{"$f":"SUMIF('00 CE'!B:B,'Tab 53'!A24,'00 CE'!G:G)","v":172275.4}]
["AA0530","Prestazioni trasporto ambulanze ed elisoccorso",null,null,null,null,null,null,{"$f":"SUMIF('00 CE'!B:B,'Tab 53'!A25,'00 CE'!G:G)","v":512404.02}]
["AA0540","Altre prestazioni sanitarie e socio-sanitarie",null,null,null,null,null,null,{"$f":"SUMIF('00 CE'!B:B,'Tab 53'!A26,'00 CE'!G:G)","v":0}]
["AA0550","Ricavi per cessione di emocomponenti e cellule staminali",null,null,null,null,null,null,{"$f":"SUMIF('00 CE'!B:B,'Tab 53'!A27,'00 CE'!G:G)","v":174766.05}]
["AA0560","Ricavi per differenziale tariffe TUC",null,null,null,null,null,null,{"$f":"SUMIF('00 CE'!B:B,'Tab 53'!A28,'00 CE'!G:G)","v":0}]
[]
[null," TOTALE RICAVI DA MOBILITA' (A+B)",{"$f":"C6+C17","v":10739191.400000002},{"$f":"D6+D17","v":28931356.859999996},11996328.530000001,4716544.5600000005,29233452.470000003,11064185.680000002,{"$f":"I6+I17","v":102173368.22000001}]
[]
[null," RICAVI PER PRESTAZIONI OGGETTO DI FATTURAZIONE DIRETTA\n INFRAREGIONALE (C)",61964.66,152927.53,65376.27,0,0,0,{"$f":"C32+D32+E32+F32+G32+H32","v":280268.46000000002}]
[]
[null," RICAVI PER PREST. OGGETTO DI FATTUR. DIRETTA EXTRAREGIONALE (D)",null,null,null,null,null,null,1696.8]
[]
[null," TOTALE RICAVI PER PREST. OGGETTO DI FATTURAZ. DIRETTA (C+D)",{"$f":"C32+C34","v":61964.66},152927.53,65376.27,0,0,0,{"$f":"I32+I34","v":281965.26}]
[]
[null," TOTALE RICAVI AZIENDE REGIONE (A+C)",{"$f":"C6+C32","v":10801156.060000002},{"$f":"D6+D32","v":29084284.389999997},12061704.800000001,4716544.5600000005,29233452.470000003,11064185.680000002,{"$f":"I6+I32","v":96961328.050000012}]
[null," TOTALE RICAVI AZIENDE EXTRA REGIONE (B+D)",null,null,null,null,null,null,{"$f":"I17+I34","v":5494005.4299999997}]
[null," TOTALE RICAVI AZIENDE SANITARIE PUBBLICHE (A+B+C+D)",{"$f":"C30+C32+C34","v":10801156.060000002},29084284.389999997,12061704.800000001,4716544.5600000005,29233452.470000003,11064185.680000002,{"$f":"I38+I39","v":102455333.48000002}]
[]
[]
["Nella riga \"Ricavi per prestazioni oggetto di fatturazione diretta infraregionale\" sono stati inseriti i ricavi conseguiti dall'Azienda nei confronti delle AASSLL della Regione per prestazioni fuori mobilità, oggetto di fatturazione diretta. Tali valori sono stati riconciliati con le AASSLL della Regione alla data del 31/12/2017."]
[]
[]
[]
["TABELLA DI RACCORDO - DETTAGLIO PER PRESTAZIONI SANITARIE IN MOBILITA'"]
["Voce CE","Descrizione","Importo","Voce CE D.Lgs. 118/2011 "]
["AA0340","Ricavi da mobilità sanitaria infraregionale",96681059.590000004,"A4 a)","a"]
["AA0450","Ricavi da mobilità sanitaria extraregionale",5492308.6299999999,null,"a"]
["AA0450","Altre prestazioni sanitarie e sociosanitarie a rilevanza sanitaria non soggette a compensazione extraregione",1696.8]
["AA0610","Ricavi per prestazioni sanitarie e sociosanitarie a rilevanza sanitaria erogate da privati v/residenti extraregione in compensazione ",12136123.77]
["AA0670","Ricavi per prestazioni sanitarie erogate in regime intramoenia",3919432.33,"A4 b)"]
["AA0440","Ricavi per prestazioni sanitarie e sociosanitarie a rilevanza sanitaria erogate ad altri soggetti pubblici",45364.98,"A4 c)"]
["AA0660","Ricavi per prestazioni sanitarie e sociosanitarie a rilevanza sanitaria erogate a privati",3569406.31]
["Totale ricavi per prestazioni sanitarie e sociosanitarie a rilevanza sanitaria",null,{"$f":"SUM(C49:C55)","v":121845392.41},"A 4"]
[]
["Somma a","Totale ricavi da mobilità sanitaria",{"$f":"C49+C50","v":102173368.22},"in accordo con Tabella 53"]
[]
[]
["I ricavi di mobilità sono diminuiti, rispetto al precedente esercizio, di circa -2.500 €/000. Detta riduzione è stata determinata dalla diminuzione dei ricavi per mobilità sanitaria extraregionale (per €/000 -4.896), parzialmente compensata dall'aumento dei ricavi da mobilità sanitaria infraregionale (per €/000 2.435). In particolare, la riduzione dei ricavi per mobilità sanitaria extraregionale è principalmente ascrivibile alla contrazione dei ricavi per prestazioni di ricovero extra Regione (per €/000 -4.772). E' opportuno precisare che la mobilità extra regionale viene contabilizzata con due anni di riterdo rispetto all'esercizio di competenza e, come stabilisce il D. Lgs. n. 118/2011, la rilevazione contabile vine e effettuata al netto (+ o -) degli eventuali conguagli. La mobilità sanitaria infraregionale è aumentata nel corso del 2017 principalmente per effetto dell'incremento della mobilità sanitaria da pubblico, in particolare nei confronti della ASL di Avezzano-Sulmona L'Aquila e della ASL di Teramo, con riferimento ai ricavi per prestazioni di ricovero (€/000 1.375) e dei ricavi per prestazioni di file F (per circa €/000 445). Anche la mobilità infraregionale da privato è aumentata (per €/000 628), in particolare a seguito dell'aumento dei ricavi per prestazioni di ricovero (€/000 459). "]

{"sheet":"Tab 54","index":8,"n_rows":33,"n_cols":6,"rows_kept":33,"cut":false,"hidden":false,"merged":[[31,0,31,5],[32,0,32,5],[1,0,2,0],[1,1,2,1],[1,2,2,2],[1,3,2,3],[1,5,2,5],[1,4,2,4]]}
[null,"Tab. 54 – Dettaglio ricavi e costi per prestazioni sanitarie erogate in regime di intramoenia"]
["CODICE MOD. CE","PRESTAZIONI SANITARIE EROGATE\nIN REGIME DI INTRAMOENIA",{"$f":"\"Valore CE \" &'00 Aggregatore'!$F$2","v":"Valore CE 2017"},{"$f":"\"Valore CE \" &'00 Aggregatore'!$F$2 -1","v":"Valore CE 2016"},"Variazioni\nimporto","%"]
[]
["AA0680","Ricavi per prestazioni sanitarie intramoenia - Area ospedaliera",{"$f":"SUMIF('00 CE'!$B:$B,'Tab 54'!$A4,'00 CE'!G:G)","v":50045.82},{"$f":"SUMIF('00 CE'!$B:$B,'Tab 54'!$A4,'00 CE'!F:F)","v":89330.21},{"$f":"C4-D4","v":-39284.390000000007},{"$f":"IF(AND(C4=0,D4=0),0,IF(C4=0,\"\",IF(D4=0,\"\",E4/D4)))","v":-0.43976600972951929}]
["AA0690","Ricavi per prestazioni sanitarie intramoenia - Area specialistica",{"$f":"SUMIF('00 CE'!$B:$B,'Tab 54'!$A5,'00 CE'!G:G)","v":3252006},{"$f":"SUMIF('00 CE'!$B:$B,'Tab 54'!$A5,'00 CE'!F:F)","v":3216315.61},{"$f":"C5-D5","v":35690.39000000013},{"$f":"IF(AND(C5=0,D5=0),0,IF(C5=0,\"\",IF(D5=0,\"\",E5/D5)))","v":1.1096669085904828E-2}]
["AA0700","Ricavi per prestazioni sanitarie intramoenia - Area sanità pubblica",{"$f":"SUMIF('00 CE'!$B:$B,'Tab 54'!$A6,'00 CE'!G:G)","v":22414.54},{"$f":"SUMIF('00 CE'!$B:$B,'Tab 54'!$A6,'00 CE'!F:F)","v":19348.810000000001},{"$f":"C6-D6","v":3065.7299999999996},0.15844540310230962]
["AA0710","Ricavi per prestazioni sanitarie intramoenia - Consulenze (ex art. 55 c.1 lett. c), d) ed ex art. 57-58)",{"$f":"SUMIF('00 CE'!$B:$B,'Tab 54'!$A7,'00 CE'!G:G)","v":478823.7},{"$f":"SUMIF('00 CE'!$B:$B,'Tab 54'!$A7,'00 CE'!F:F)","v":520863.67},{"$f":"C7-D7","v":-42039.969999999972},-8.0712041214162575E-2]
["AA0720","Ricavi per prestazioni sanitarie intramoenia - Consulenze (ex art. 55 c.1 lett. c), d) ed ex art. 57-58) (Aziende sanitarie pubbliche della Regione)",{"$f":"SUMIF('00 CE'!$B:$B,'Tab 54'!$A8,'00 CE'!G:G)","v":0},{"$f":"SUMIF('00 CE'!$B:$B,'Tab 54'!$A8,'00 CE'!F:F)","v":0},{"$f":"C8-D8","v":0},0]
["AA0730","Ricavi per prestazioni sanitarie intramoenia - Altro",{"$f":"SUMIF('00 CE'!$B:$B,'Tab 54'!$A9,'00 CE'!G:G)","v":97870.17},{"$f":"SUMIF('00 CE'!$B:$B,'Tab 54'!$A9,'00 CE'!F:F)","v":109709.92},{"$f":"C9-D9","v":-11839.75},-0.10791868228506593]
["AA0740","Ricavi per prestazioni sanitarie intramoenia - Altro (Aziende sanitarie pubbliche della Regione)",{"$f":"SUMIF('00 CE'!$B:$B,'Tab 54'!$A10,'00 CE'!G:G)","v":18272.099999999999},{"$f":"SUMIF('00 CE'!$B:$B,'Tab 54'!$A10,'00 CE'!F:F)","v":0},{"$f":"C10-D10","v":18272.099999999999},""]
[null,"TOTALE RICAVI INTRAMOENIA",{"$f":"SUM(C4:C10)","v":3919432.33},{"$f":"SUM(D4:D10)","v":3955568.2199999997},-36135.889999999665,-9.1354485601564638E-3]
["BA1210","Compartecipazione al personale per att. libero professionale intramoenia - Area ospedaliera",{"$f":"SUMIF('00 CE'!$B:$B,'Tab 54'!$A12,'00 CE'!G:G)","v":36801.340000000004},{"$f":"SUMIF('00 CE'!$B:$B,'Tab 54'!$A12,'00 CE'!F:F)","v":65875.14},-29073.799999999996,-0.44134706962292597]
["BA1220","Compartecipazione al personale per att. libero professionale intramoenia- Area specialistica",{"$f":"SUMIF('00 CE'!$B:$B,'Tab 54'!$A13,'00 CE'!G:G)","v":2790651.77},{"$f":"SUMIF('00 CE'!$B:$B,'Tab 54'!$A13,'00 CE'!F:F)","v":2668850.25},121801.52000000002,4.5638199445622703E-2]
["BA1230","Compartecipazione al personale per att. libero professionale intramoenia - Area sanità pubblica",{"$f":"SUMIF('00 CE'!$B:$B,'Tab 54'!$A14,'00 CE'!G:G)","v":19073.689999999999},{"$f":"SUMIF('00 CE'!$B:$B,'Tab 54'!$A14,'00 CE'!F:F)","v":16818.95},2254.739999999998,0.13405949836345299]
["BA1240","Compartecipazione al personale per att. libero professionale intramoenia - Consulenze (ex art. 55 c.1 lett. c), d) ed ex Art. 57-58)",{"$f":"SUMIF('00 CE'!$B:$B,'Tab 54'!$A15,'00 CE'!G:G)","v":371493.34},{"$f":"SUMIF('00 CE'!$B:$B,'Tab 54'!$A15,'00 CE'!F:F)","v":444810.38},-73317.039999999979,-0.16482762834806144]
["BA1250","Compartecipazione al personale per att. libero professionale intramoenia- Consulenze (ex art. 55 c.1 lett. c), d) ed ex Art. 57-58) (Aziende sanitarie pubbliche della Regione)",{"$f":"SUMIF('00 CE'!$B:$B,'Tab 54'!$A16,'00 CE'!G:G)","v":0},{"$f":"SUMIF('00 CE'!$B:$B,'Tab 54'!$A16,'00 CE'!F:F)","v":0},0,0]
["BA1260","Compartecipazione al personale per att. libero professionale intramoenia - Altro",{"$f":"SUMIF('00 CE'!$B:$B,'Tab 54'!$A17,'00 CE'!G:G)","v":75468.47},{"$f":"SUMIF('00 CE'!$B:$B,'Tab 54'!$A17,'00 CE'!F:F)","v":96287.97},-20819.5,-0.21622119564884376]
["BA1270","Compartecipazione al personale per att. libero  professionale intramoenia- Altro (Aziende sanitarie pubbliche della Regione)",{"$f":"SUMIF('00 CE'!$B:$B,'Tab 54'!$A18,'00 CE'!G:G)","v":0},{"$f":"SUMIF('00 CE'!$B:$B,'Tab 54'!$A18,'00 CE'!F:F)","v":0},0,0]
[null,"TOTALE QUOTE RETROCESSE AL PERSONALE (ESCLUSO IRAP)",{"$f":"SUM(C12:C18)","v":3293488.61},{"$f":"SUM(D12:D18)","v":3292642.6900000004},845.92000000004191,2.5691217652287735E-4]
[null,"Indennità di esclusività medica per attività di libera professione",0,0,0,0]
["YA0040","IRAP relativa ad attività di libera professione (intramoenia)",275247.39,274847.06,400.3300000000163,{"$f":"IF(C21=0,0,ROUND(E21/C21,4))","v":1.5E-3}]
[null,"Costi diretti aziendali",305194,342169,-36975,-0.1212]
[null,"Costi generali aziendali",33116.929999999993,43108,-9991.070000000007,-0.30170000000000002]
["**","Fondo di perequazione",0,0,0,0]
[null,"TOTALE ALTRI COSTI INTRAMOENIA",{"$f":"SUM(C20:C24)","v":613558.32000000007},{"$f":"SUM(D20:D24)","v":660124.06000000006},-46565.739999999991,-7.5899999999999995E-2]
[null,"RICAVI - COSTI INTRAMOENIA",{"$f":"C11-(C19+C25)","v":12385.400000000373},{"$f":"D11-(D19+D25)","v":2801.4699999992736},9583.930000001099,0.77380000000000004]
[]
[]
["YA0040","IRAP relativa ad attività di libera professione (intramoenia)",458072.41000000003,481354.25]
["*","Scostamento Voce CE vs Tabella 54",{"$f":"C21-C29","v":-182825.02000000002},{"$f":"D21-D29","v":-206507.19}]
[]
["* Lo scostamento evidenziato si riferisce al conto 1101030102 \"IRAP libera professione relativa ad attività istituzionale (ex. art. 55 c. 2 CCNL)\""]
["** Il valore del Fondo di Perequazione è contabilizzato nelle voci di CE relative al TOTALE QUOTE RETROCESSE AL PERSONALE (ESCLUSO IRAP) - Tab 54"]

{"sheet":"Tab 55","index":9,"n_rows":27,"n_cols":7,"rows_kept":27,"cut":false,"hidden":false,"merged":[[24,0,24,1],[25,0,25,1],[25,2,25,3],[25,4,25,7],[26,0,26,1],[26,4,26,7]]}
[null,"Tab. 55 – Dettaglio rimborsi da aziende sanitarie pubbliche della Regione per acquisti di beni "]
[null,"DETTAGLIO RIMBORSI DA \nAZIENDE SANITARIE PUBBLICHE DELLA REGIONE\nPER ACQUISTI DI BENI ","Azienda …","Azienda …","Azienda …","Azienda …","TOTALE"]
[null,"Prodotti farmaceutici ed emoderivati:"]
[null,"Medicinali con AIC, ad eccezione di vaccini ed emoderivati di produzione regionale"]
[null,"Medicinali senza AIC"]
[null,"Emoderivati di produzione regionale"]
[null,"Sangue ed emocomponenti"]
[null,"Dispositivi medici:"]
[null,"Dispositivi medici"]
[null,"Dispositivi medici impiantabili attivi"]
[null,"Dispositivi medico diagnostici in vitro (IVD)"]
[null,"Prodotti dietetici"]
[null,"Materiali per la profilassi (vaccini)"]
[null,"Prodotti chimici"]
[null,"Materiali e prodotti per uso veterinario"]
[null,"Altri beni e prodotti sanitari"]
[null,"Prodotti alimentari"]
[null,"Materiali di guardaroba, di pulizia e di convivenza in genere"]
[null,"Combustibili, carburanti e lubrificanti"]
[null,"Supporti informatici e cancelleria"]
[null,"Materiale per la manutenzione"]
[null,"Altri beni e prodotti non sanitari"]
[null,"TOTALE"]
[]
["Altre informazioni relative a proventi e ricavi diversi"]
["Informazione",null,"Caso presente in azienda?",null,"Se sì, illustrare"]
["CT01. Sono state rilevate significative variazioni rispetto all'esercizio precedente?",null,null,"NO"]

{"sheet":"Tab 56-57","index":10,"n_rows":38,"n_cols":10,"rows_kept":38,"cut":false,"hidden":false,"merged":[[13,1,13,5],[0,0,0,1],[2,1,2,5],[3,1,4,1],[3,2,3,3],[3,4,4,4]]}
["19.     Acquisti di beni"]
[]
[null,"Tab. 56 – Dettaglio acquisti di beni sanitari per tipologia di distribuzione "]
[null,"DETTAGLIO ACQUISTI DI BENI SANITARI\nPER TIPOLOGIA DI DISTRIBUZIONE","Distribuzione",null,"TOTALE"]
[null,null,"Diretta","Per conto"]
[null,"Prodotti farmaceutici ed emoderivati:"]
[null,"Medicinali con AIC, ad eccezione di vaccini ed emoderivati di produzione regionale",39238304.159999996,null,{"$f":"SUM(C7:D7)","v":39238304.159999996}]
[null,"Medicinali senza AIC",2460.71,null,{"$f":"SUM(C8:D8)","v":2460.71}]
[null,"Emoderivati di produzione regionale",0,null,{"$f":"SUM(C9:D9)","v":0}]
[null,"Prodotti dietetici",0,null,{"$f":"SUM(C10:D10)","v":0}]
[null,"TOTALE",{"$f":"SUM(C7:C10)","v":39240764.869999997},{"$f":"SUM(D7:D10)","v":0},{"$f":"SUM(E7:E10)","v":39240764.869999997}]
[]
[]
[null,"Tab. 57 – Dettaglio acquisti di beni da aziende sanitarie pubbliche "]
["CODICE MOD. CE","DETTAGLIO ACQUISTI DI BENI DA \nAZIENDE SANITARIE PUBBLICHE DELLA REGIONE","Azienda …","Azienda …","Azienda …","Azienda ","TOTALE",null,2016]
["BA0030","Prodotti farmaceutici ed emoderivati:",null,null,null,null,{"$f":"SUMIF('00 CE'!B:B,'Tab 56-57'!A16,'00 CE'!G:G)","v":69958395.310000017},null,67757822.909999996,{"$f":"G16-I16","v":2200572.4000000209}]
["BA0040","Medicinali con AIC, ad eccezione di vaccini ed emoderivati di produzione regionale",null,null,null,null,{"$f":"SUMIF('00 CE'!B:B,'Tab 56-57'!A17,'00 CE'!G:G)","v":69235809.470000014},null,66456835.450000003,{"$f":"G17-I17","v":2778974.0200000107}]
["BA0050","Medicinali senza AIC",null,null,null,null,{"$f":"SUMIF('00 CE'!B:B,'Tab 56-57'!A18,'00 CE'!G:G)","v":722585.84},null,1300987.46,-578401.62]
["BA0060","Emoderivati di produzione regionale",null,null,null,null,{"$f":"SUMIF('00 CE'!B:B,'Tab 56-57'!A19,'00 CE'!G:G)","v":0},null,0,0]
["BA0070","Sangue ed emocomponenti",null,null,null,null,{"$f":"SUMIF('00 CE'!B:B,'Tab 56-57'!A20,'00 CE'!G:G)","v":187348.99},null,133040.57,54308.419999999984]
["BA0210","Dispositivi medici:",null,null,null,null,{"$f":"SUMIF('00 CE'!B:B,'Tab 56-57'!A21,'00 CE'!G:G)","v":41189711.570000008},null,40472326.140000001,717385.43000000715]
["BA0220","Dispositivi medici",null,null,null,null,{"$f":"SUMIF('00 CE'!B:B,'Tab 56-57'!A22,'00 CE'!G:G)","v":25764695.790000003},null,25227619.200000003,537076.58999999985]
["BA0230","Dispositivi medici impiantabili attivi",null,null,null,null,{"$f":"SUMIF('00 CE'!B:B,'Tab 56-57'!A23,'00 CE'!G:G)","v":3456008.28},null,3795874.49,-339866.21000000043]
["BA0240","Dispositivi medico diagnostici in vitro (IVD)",null,null,null,null,{"$f":"SUMIF('00 CE'!B:B,'Tab 56-57'!A24,'00 CE'!G:G)","v":11969007.5},null,11448832.449999999,520175.05000000075]
["BA0250","Prodotti dietetici",null,null,null,null,{"$f":"SUMIF('00 CE'!B:B,'Tab 56-57'!A25,'00 CE'!G:G)","v":469645.74000000005},null,440667.16000000003,28978.580000000016]
["BA0260","Materiali per la profilassi (vaccini)",null,null,null,null,{"$f":"SUMIF('00 CE'!B:B,'Tab 56-57'!A26,'00 CE'!G:G)","v":2380862.56},null,1380588.41,1000274.1500000001]
["BA0270","Prodotti chimici",null,null,null,null,{"$f":"SUMIF('00 CE'!B:B,'Tab 56-57'!A27,'00 CE'!G:G)","v":0},null,0,0]
["BA0280","Materiali e prodotti per uso veterinario",null,null,null,null,{"$f":"SUMIF('00 CE'!B:B,'Tab 56-57'!A28,'00 CE'!G:G)","v":7852.7999999999993},null,33301.29,-25448.49]
["BA0290","Altri beni e prodotti sanitari",null,null,null,null,{"$f":"SUMIF('00 CE'!B:B,'Tab 56-57'!A29,'00 CE'!G:G)","v":1934574.6},null,1513330.23,421244.37000000011]
["BA0300","Beni e prodotti sanitari da Aziende sanitarie pubbliche della Regione",null,null,null,null,{"$f":"SUMIF('00 CE'!B:B,'Tab 56-57'!A30,'00 CE'!G:G)","v":0},null,0,0]
["BA0320","Prodotti alimentari",null,null,null,null,{"$f":"SUMIF('00 CE'!B:B,'Tab 56-57'!A31,'00 CE'!G:G)","v":250.58},null,259.32,-8.7399999999999807]
["BA0330","Materiali di guardaroba, di pulizia e di convivenza in genere",null,null,null,null,{"$f":"SUMIF('00 CE'!B:B,'Tab 56-57'!A32,'00 CE'!G:G)","v":41796.379999999997},null,29848.15,11948.229999999996]
["BA0340","Combustibili, carburanti e lubrificanti",null,null,null,null,{"$f":"SUMIF('00 CE'!B:B,'Tab 56-57'!A33,'00 CE'!G:G)","v":135937.70000000001},null,125554.88,10382.820000000007]
["BA0350","Supporti informatici e cancelleria",null,null,null,null,{"$f":"SUMIF('00 CE'!B:B,'Tab 56-57'!A34,'00 CE'!G:G)","v":513727.87},null,597417.69000000006,-83689.820000000065]
["BA0360","Materiale per la manutenzione",null,null,null,null,{"$f":"SUMIF('00 CE'!B:B,'Tab 56-57'!A35,'00 CE'!G:G)","v":207783.52999999997},null,252738.81,-44955.280000000028]
["BA0370","Altri beni e prodotti non sanitari",null,null,null,null,{"$f":"SUMIF('00 CE'!B:B,'Tab 56-57'!A36,'00 CE'!G:G)","v":48626.559999999998},null,49743.28,-1116.7200000000012]
["BA0380","Beni e prodotti non sanitari da Aziende sanitarie pubbliche della Regione",null,null,null,null,{"$f":"SUMIF('00 CE'!B:B,'Tab 56-57'!A37,'00 CE'!G:G)","v":0},null,0,0]
[null,"TOTALE",null,null,null,null,{"$f":"G16+G20+G21+G25+G26+G27+G28+G29+G30+G32+G31+G33+G34+G35+G36","v":117076514.19000001},null,112786638.83999999,4289875.3500000238]

{"sheet":"AB01-02-03","index":11,"n_rows":19,"n_cols":5,"rows_kept":19,"cut":false,"hidden":false,"merged":[[12,0,12,6],[14,0,14,6],[13,0,13,6],[9,0,10,6],[18,0,20,6],[17,0,17,6],[16,0,16,6],[15,0,15,6],[11,0,11,6],[1,1,1,6],[5,4,5,6],[6,4,6,6],[4,4,4,6],[6,0,6,1],[4,0,4,1],[4,2,4,3],[5,0,5,1]]}
["AB01 - Acquisti di beni"]
["AB01 ","Ciascuna tipologia di bene, compreso nelle voci relative agli acquisti di beni sanitari e non sanitari, è monitorata attraverso il sistema gestionale del magazzino, che rileva ogni tipologia di movimento, in entrata e in uscita."]
[]
["Altre informazioni relative agli acquisti di beni"]
["Informazione",null,"Caso presente in azienda?",null,"Se SI, illustrare"]
["AB02. Sono stati rilevati costi per acquisto di beni da altre Aziende Sanitarie della Regione? Se sì, di quali tipologie di beni si tratta?",null,null,"NO"]
["AB03. Sono state rilevate significative variazioni rispetto all'esercizio precedente?",null,null,"SI","Si veda commento sottostante."]
[]
[]
["Il costo per acquisti di beni ha subito un incremento del 4% rispetto all'esercizio precedente ( circa 4 €/mln). Tale variazione è dovuta sostanzialmente all'incremento delle seguenti voci: "]
[]
["- i costi di acquisto di prodotti farmaceutici ed emoderivati, in particolare dei medicinali con AIC (+ €/mln 2,7); "]
["- i costi di acquisto dei vaccini (+ €/mln 1). "]
["Nonostante le azioni di contenimento e razionalizzazione messe in campo dall'Azienda nel corso dell'esercizio, il costo per l'acquisto dei farmaci è aumentato di circa €/mln 2,7. In particolare, come meglio esplicitato nella Relazione sulla gestione, tale incremento è stato determinato  principalmente dall'aumento della spesa per \"anticorpi monoclonali\" e \"fattori della coagulazione del sangue\", generato dai consumi ospedalieri nell'ambito delle terapie onco-ematologiche e per le terapie per emofilici, che caratterizzano l'offerta assistenziale della ASL di Pescara. Un'altra causa dell'incremento della spesa relativa ad alcune classi terapeutiche è legata alla Distribuzione Diretta \"Esclusiva\" che, derivando direttamente dalle prescrizioni dei medici specialisti, nella forma di piano terapeutico anzichè di impegnativa SSN \"tout court\", è difficilmente riconducibile nell'ambito del governo diretto della spesa da parte dell'Azienda. "]
["L'incremento dei costi per vaccini è una conseguenza dei provvedimenti normativi adottati sia a livello nazionale che regionale nel corso dell'esercizio 2017."]
["In ogni caso, l'Azienda intende proseguire il percorso di contenimento della spesa farmaceutica già intrapreso nei precedenti esercizi. In particolare, in presenza di contenuti margini di azione sui prezzi e sui livelli di giacenza, la ASL di Pescara intende consolidare le seguenti azioni di razionalizzazione:   "]
["- Intervenire sull'appropriatezza prescrittiva, incentivando ad esempio la prescrizione di farmaci biosimilari da parte dei medici. In realtà, questa azione è già stata intrapresa da tempo, ma non ha sempre prodotto gli effetti sperati, anche a causa delle variazioni di prezzo di mercato tra farmaco originator e biosimilare;"]
["- Attivazione del Prontuario Terapeutico Aziendale;"]
["- Incentivare in misura più incisiva la corretta gestione degli armadi di reparto, al fine di migliorare il monitoraggio delle scorte di reparto e conseguentemente razionalizzare le richieste di farmaci. Per tale attività, il personale interessato è già stato formato, ma in alcune strutture, dove vi sono particolari elementi di complessità, persistono alcune problematiche organizzative che l'Azienda ha in animo di superare. Rispetto al passato, sono stati effettuati alcuni passi in avanti nella gestione degli stessi da parte dei reparti, ma sussistono ancora significativi margini di miglioramento su cui l'Azienda intende focalizzare i suoi interventi."]

{"sheet":"Tab. 57bis","index":12,"n_rows":41,"n_cols":9,"rows_kept":41,"cut":false,"hidden":false,"merged":[[0,1,0,7],[1,1,1,8],[2,1,2,3],[2,5,3,5],[2,6,2,8]]}
[null,null,null,null,null,null,null,null,"Tabella 57-bis"]
[null,"FARMACI INNOVATIVI \nai sensi dell’art. 1, commi 402, 403 e 404, della legge 11 dicembre 2016, n. 232 (legge di Bilancio 2017 ss.mm.ii.)"]
[null,"Farmaci",null,null,"Costo CE","Prezzi medi di acquisto Consuntivo 2017","Importo payback/note di credito ricevute direttamente dalla ASL (prezzo/volume, capping ed altri accordi)\nCONSUNTIVO 2017"]
["Fondo Inn.","AIC","Denominazione e Confezione","Principio attivo","Consuntivo 2017",null,"Riferito ad acquisti 2017 ","Riferito ad acquisti 2016","Riferito ad acquisti anni precedenti"]
["IO","039399011","ABRAXANE*INF 100MG 5MG/ML","paclitaxel",156402.79,245.53,0,0,0]
["I","043542012","DAKLINZA*28CPR RIV 30MG","daclatasvir",0,0,0,0,0]
["I","043542036","DAKLINZA*28CPR RIV 60MG","daclatasvir",270599.98,117.86,70399.989999999991,23466.649999999998,0]
["I","044928012","EPCLUSA 1FL 28CPR 400+100MG","sofosbuvir/velpatasvir",4326667.55,654.76,3696148.2899999996,0,0]
["I","043840014","EXVIERA*56CPR RIV 250MG","dasabuvir",17100.080000000002,4.8499999999999996,4204.3600000000006,0,0]
["I","043731013","HARVONI*1FL 28CPR RIV 90+400MG","sofosbuvir e ledipasvir",1119250.26,532.98,988237.83000000007,223850.09999999998,0]
["IO","043693023","IMBRUVICA*FL 120CPS 140MG","ibrutinib",155697.87,6227.91,0,0,0]
["IO","043693011","IMBRUVICA*FL 90CPS 140MG","ibrutinib",252231.13,51.9,0,0,0]
["I","043519026","KALYDECO*56CPR RIV 150MG","ivacaftor",0,0,0,0,0]
["IO","044386011","KEYTRUDA*1FL POLV EV 50MG/ML","pembrolizumab",363578.96,1454.32,0,0,0]
["IO","044386023","KEYTRUDA*1FL 4ML 25MG/ML                ","pembrolizumab",214935.6,2828.1,0,0,0]
["I","045445018","MAVIRET*84CPR RIV 100MG+40MG","glecaprevir/pibrentasvir",39187.5,46.65,0,0,0]
["I","043441029","OLYSIO*28CPS 150MG","simeprevir",7333.33,130.94999999999999,0,0,0]
["I","043441017","OLYSIO*7CPS 150MG","simeprevir",0,0,0,0,0]
["IO","044291021","OPDIVO*INFUS 1F 10ML 10MG/ML","nivolumab",576827.09,1204.23,0,0,0]
["IO","044291019","OPDIVO*INFUS 1F 4ML 10MG/ML","nivolumab",151922.19,480.77,0,0,0]
["IO","042682017","PERJETA*EV 1F 420MG 30MG/ML","pertuzumab",313642.46000000002,3015.79,0,0,0]
["I","043196017","SOVALDI*1FL 28CPR RIV 400MG","sofosbuvir",1478766.27,484.52,1260996.54,203499.91,0]
["I","045426018","SPINRAZA*1FL 12MG 5ML 2,4MG/ML","nusinersen",0,0,0,0,0]
["I","044880019","STRIMVELIS EV 1-10MILIONI CELL","cellule autologhe CD34+",0,0,0,0,0]
["I","043841016","VIEKIRAX*56CPR 12,5+75+50MG","ombitasvir, paritaprevir e ritonavir",232404.02,56.85,77697.5,0,0]
["I","044929014","ZEPATIER 28CPR RIV 50MG+100MG","elbasvir/grazoprevir",653400,117.86,0,0,0]
["IO","043620018","ZYDELIG*FL 60CPR RIV 100MG","idelalisib",21560.23,51.33,0,0,0]
["IO","043620020","ZYDELIG*FL 60CPR RIV 150MG","idelalisib",40040.019999999997,51.33,0,0,0]
[null,null,null,null,{"$f":"SUM(E5:E28)","v":10391547.33},{"$f":"SUM(F5:F28)","v":17758.490000000002},6097684.5099999988,450816.66,0]
[null,null,"Importo Lordo"]
[null,"I","Fondo innovativi non oncologici",null,{"$f":"SUMIF(A:A,B31,E:E)","v":8144708.9899999984}]
[null,"IO","Fondo innovativi oncologici",null,{"$f":"SUMIF(A:A,B32,E:E)","v":2246838.34}]
[null,null,null,null,{"$f":"SUM(E31:E32)","v":10391547.329999998}]
[null,null,"NC 2017"]
[null,"I","Fondo innovativi non oncologici",null,{"$f":"SUMIF(A:A,B35,G:G)*-1","v":-6097684.5099999988}]
[null,"IO","Fondo innovativi oncologici",null,{"$f":"SUMIF(A:A,B36,G:G)*-1","v":0}]
[null,null,null,null,{"$f":"SUM(E35:E36)","v":-6097684.5099999988}]
[null,null,"Importo Netto"]
[null,"I","Fondo innovativi non oncologici",null,{"$f":"E31+E35","v":2047024.4799999995}]
[null,"IO","Fondo innovativi oncologici",null,{"$f":"E32+E36","v":2246838.34}]
[null,null,null,null,{"$f":"SUM(E39:E40)","v":4293862.8199999994}]

{"sheet":"Tab 58","index":13,"n_rows":48,"n_cols":14,"rows_kept":48,"cut":false,"hidden":false,"merged":[[47,0,47,8],[44,0,45,8],[0,0,0,5],[2,1,2,8],[3,0,4,0],[3,1,4,1],[3,2,3,4],[3,5,3,7],[3,8,4,8]]}
["20.     Acquisti di servizi"]
[]
[null,"Tab. 58 – Dettaglio acquisti di servizi sanitari in mobilità"]
["CODICE MOD. CE","DETTAGLIO ACQUISTI DI SERVIZI SANITARI IN MOBILITA'","PUBBLICO",null,null,"PRIVATO",null,null,"TOTALE"]
[null,null,"Avezzano-Sulmona-L'Aquila","Lanciano-Vasto-Chieti","Teramo","Avezzano-Sulmona-L'Aquila","Lanciano-Vasto-Chieti","Teramo",null,null,"VALORE CE","Diff","Ctrl"]
[null,"COSTI DA MOBILITA' SANITARIA INFRAREGIONALE (A)",{"$f":"SUM(C7:C18)","v":3798653.95},30053835.800000001,5309421.0600000005,1724411.95,8284845.7999999998,2100511.36,51271679.929999992,null,51271679.929999992]
["BA0470","Acquisti servizi sanitari per medicina di base",7861.84,18739.98,8455.3700000000008,0,0,0,{"$f":"SUMIF('00 CE'!B:B,'Tab 58'!A7,'00 CE'!G:G)","v":35057.19},null,{"$f":"SUMIF('00 CE'!B:B,'Tab 58'!A7,'00 CE'!G:G)","v":35057.19},{"$f":"I7-K7","v":0},{"$f":"IF(L7=0,\"OK\",\" CTRL\")","v":"OK"}]
["BA0510","Acquisti servizi sanitari per farmaceutica",254529.82,848731.57,148709.12,0,0,0,{"$f":"SUMIF('00 CE'!B:B,'Tab 58'!A8,'00 CE'!G:G)","v":1251970.51},null,{"$f":"SUMIF('00 CE'!B:B,'Tab 58'!A8,'00 CE'!G:G)","v":1251970.51},{"$f":"I8-K8","v":0},{"$f":"IF(L8=0,\"OK\",\" CTRL\")","v":"OK"}]
["BA0540","Acquisti servizi sanitari per assistenza specialistica ambulatoriale",637302,6189958,854701,42867.17,1268989.99,4303.9399999999996,{"$f":"SUMIF('00 CE'!B:B,'Tab 58'!A9,'00 CE'!G:G)","v":8998122.1099999994},null,{"$f":"SUMIF('00 CE'!B:B,'Tab 58'!A9,'00 CE'!G:G)","v":8998122.1099999994},0,"OK"]
["BA0650","Acquisti servizi sanitari per assistenza riabilitativa",0,0,0,155178.85,2629501.2999999998,2070380.02,{"$f":"SUMIF('00 CE'!B:B,'Tab 58'!A10,'00 CE'!G:G)","v":4855060.17},null,{"$f":"SUMIF('00 CE'!B:B,'Tab 58'!A10,'00 CE'!G:G)","v":4855060.17},0,"OK"]
["BA0710","Acquisti servizi sanitari per assistenza integrativa",0,0,0,0,0,0,{"$f":"SUMIF('00 CE'!B:B,'Tab 58'!A11,'00 CE'!G:G)","v":0},null,{"$f":"SUMIF('00 CE'!B:B,'Tab 58'!A11,'00 CE'!G:G)","v":0},0,"OK"]
["BA0760","Acquisti servizi sanitari per assistenza protesica",0,0,0,0,0,0,{"$f":"SUMIF('00 CE'!B:B,'Tab 58'!A12,'00 CE'!G:G)","v":0},null,{"$f":"SUMIF('00 CE'!B:B,'Tab 58'!A12,'00 CE'!G:G)","v":0},0,"OK"]
["BA0810","Acquisti servizi sanitari per assistenza ospedaliera",2729408.85,18825843.190000001,4121917.58,1028109.19,1524812.49,0,{"$f":"SUMIF('00 CE'!B:B,'Tab 58'!A13,'00 CE'!G:G)","v":28230091.68},null,{"$f":"SUMIF('00 CE'!B:B,'Tab 58'!A13,'00 CE'!G:G)","v":28230091.68},0,"OK"]
["BA0910","Acquisto prestazioni di psichiatria residenziale e semiresidenziale",0,0,0,450621.65,1197543.01,0,{"$f":"SUMIF('00 CE'!B:B,'Tab 58'!A14,'00 CE'!G:G)","v":1648164.66},null,{"$f":"SUMIF('00 CE'!B:B,'Tab 58'!A14,'00 CE'!G:G)","v":1648164.66},0,"OK"]
["BA0970","Acquisto prestazioni di distribuzione farmaci File F",134679.46,4094328.33,162401.91,0,0,0,{"$f":"SUMIF('00 CE'!B:B,'Tab 58'!A15,'00 CE'!G:G)","v":4391409.7},null,{"$f":"SUMIF('00 CE'!B:B,'Tab 58'!A15,'00 CE'!G:G)","v":4391409.7},0,"OK"]
["BA1040","Acquisto prestazioni termali in convenzione",0,0,0,0,0,0,{"$f":"SUMIF('00 CE'!B:B,'Tab 58'!A16,'00 CE'!G:G)","v":0},null,{"$f":"SUMIF('00 CE'!B:B,'Tab 58'!A16,'00 CE'!G:G)","v":0},0,"OK"]
["BA1100","Acquisto prestazioni trasporto sanitario",34871.980000000003,76234.73,13236.08,0,0,0,{"$f":"SUMIF('00 CE'!B:B,'Tab 58'!A17,'00 CE'!G:G)","v":124342.79},null,{"$f":"SUMIF('00 CE'!B:B,'Tab 58'!A17,'00 CE'!G:G)","v":124342.79},0,"OK"]
["BA1150","Acquisto prestazioni Socio-Sanitarie a rilevanza sanitaria",0,0,0,47635.09,1663999.01,25827.4,{"$f":"SUMIF('00 CE'!B:B,'Tab 58'!A18,'00 CE'!G:G)","v":1737461.12},null,{"$f":"SUMIF('00 CE'!B:B,'Tab 58'!A18,'00 CE'!G:G)","v":1737461.12},0,"OK"]
[]
[null,"COSTI DA MOBILITA' SANITARIA EXTRAREGIONALE (B)",{"$f":"SUM(C21:C29)","v":0},0,0,0,0,0,{"$f":"SUM(I21:I29)","v":30055274.890000001}]
["BA0480","Acquisti servizi sanitari per medicina di base",null,null,null,null,null,null,{"$f":"SUMIF('00 CE'!B:B,'Tab 58'!A21,'00 CE'!G:G)","v":184748.58}]
["BA0520","Acquisti servizi sanitari per farmaceutica",null,null,null,null,null,null,{"$f":"SUMIF('00 CE'!B:B,'Tab 58'!A22,'00 CE'!G:G)","v":387832.02}]
["BA0560","Acquisti servizi sanitari per assistenza specialistica ambulatoriale",null,null,null,null,null,null,{"$f":"SUMIF('00 CE'!B:B,'Tab 58'!A23,'00 CE'!G:G)","v":4460024.9400000004}]
["BA0730","Acquisti servizi sanitari per assistenza integrativa",null,null,null,null,null,null,{"$f":"SUMIF('00 CE'!B:B,'Tab 58'!A24,'00 CE'!G:G)","v":0}]
["BA0780","Acquisti servizi sanitari per assistenza protesica",null,null,null,null,null,null,{"$f":"SUMIF('00 CE'!B:B,'Tab 58'!A25,'00 CE'!G:G)","v":0}]
["BA0830","Acquisti servizi sanitari per assistenza ospedaliera",null,null,null,null,null,null,{"$f":"SUMIF('00 CE'!B:B,'Tab 58'!A26,'00 CE'!G:G)","v":23048879.050000001},null,null,null,null,9420]
["BA0990","Acquisto prestazioni di distribuzione farmaci e File F",null,null,null,null,null,null,{"$f":"SUMIF('00 CE'!B:B,'Tab 58'!A27,'00 CE'!G:G)","v":1585422.33}]
["BA1060","Acquisto prestazioni termali in convenzione",null,null,null,null,null,null,{"$f":"SUMIF('00 CE'!B:B,'Tab 58'!A28,'00 CE'!G:G)","v":159884.29}]
["BA1120","Acquisto prestazioni trasporto sanitario",null,null,null,null,null,null,{"$f":"SUMIF('00 CE'!B:B,'Tab 58'!A29,'00 CE'!G:G)","v":228483.68}]
[]
[null,"TOTALE COSTI DA MOBILITA' (A+B)",{"$f":"C6+C20","v":3798653.95},{"$f":"D6+D20","v":30053835.800000001},5309421.0600000005,1724411.95,8284845.7999999998,2100511.36,81326954.819999993]
[]
[null,"COSTI PER PRESTAZIONI OGGETTO DI FATTURAZIONE DIRETTA INFRAREGIONALE (C)",158617.26999999999,54003.31,233174.16,0,0,0,{"$f":"SUM(C33:H33)","v":445794.74}]
[]
[null,"COSTI PER PREST. OGGETTO DI FATTUR. DIRETTA EXTRAREGIONALE (D)",null,null,null,null,null,null,236105.21]
[]
[null,"TOTALE COSTI PER PREST. OGGETTO DI FATTURAZ. DIRETTA (C+D)",{"$f":"C33+C35","v":158617.26999999999},54003.31,233174.16,0,0,0,{"$f":"SUM(C37:H37)+I35","v":681899.95}]
[]
[null,"TOTALE COSTI AZIENDE REGIONE (A+C)",{"$f":"C33+C6","v":3957271.22},30107839.109999999,5542595.2200000007,1724411.95,8284845.7999999998,2100511.36,{"$f":"I33+I6","v":51717474.669999994}]
[null,"TOTALE COSTI AZIENDE EXTRA REGIONE (B+D)",null,null,null,null,null,null,{"$f":"I20+I35","v":30291380.100000001}]
[null,"TOTALE COSTI AZIENDE SANITARIE PUBBLICHE (A+B+C+D)",{"$f":"C31+C33+C35","v":3957271.22},30107839.109999999,5542595.2200000007,1724411.95,8284845.7999999998,{"$f":"H31+H33+H35","v":2100511.36},{"$f":"I31+I33+I35","v":82008854.769999981}]
[]
[]
[]
["Nella riga \"Costi per prestazioni oggetto di fatturazione diretta infraregionale\" sono stati inseriti i costi sostenuti dall'Azienda nei confronti delle AASSLL della Regione per prestazioni fuori mobilità, oggetto di fatturazione diretta. Tali valori sono stati riconciliati con le AASSLL della Regione alla data del 31/12/2017."]
[]
[]
["I costi di mobilità sono aumentati, rispetto al precedente esercizio, di circa €/000 1.297 (+ 2%). Detta variazione è stata determinata dall'incremento dei costi per mobilità sanitaria extraregionale, atteso che i costi per mobilità sanitaria intraregionale risultano pressochè in linea con quelli dell'esercizio 2016.  I costi per mobilità sanitaria extraregionale sono aumentati nel corso del 2017 principalmente per effetto dell'incremento dei costi per acquisti di servizi sanitari per assistenza specialistica ambulatoriale (per €/000 1.411) e per acquisto prestazioni di distribuzione farmaci e File F (€/000 413). Tali incrementi sono stati parzialmente compensati dalla riduzione dei costi per acquisti di servizi sanitari per assistenza ospedaliera (per €/000 - 587).  In merito alla mobilità sanitaria extra regionale va precisato, ad ogni buon conto, che essa, ai sensi del D. Lgs. 118/2011, viene contabilizzata con due anni di ritardo rispetto all'esercizio di competenza e, come stabilisce il citato decreto, la rilevazione contabile viene effettuata al netto degli eventuali conguagli (+ o -) dei due esercizi precedenti. Con riferimento alle prestazioni di File F, a fronte dell'aumento dei costi di mobilità extraregionale per + €/000 413, è stata registrata una riduzione dei costi di mobilità infraregionale per - €/000 632, per cui il costo complessivo per acquisti di prestazioni di distribuzione farmaci File F si è ridotto di €/000 219. A ciò si aggiunge un incremento dei ricavi per prestazioni di File F, esposti in Tabella 53, sia relativamente alla mobilità infraregionale (+ €/000 445) che extraregionale (+€/000 662)."]

{"sheet":"Tab 58 bis","index":14,"n_rows":79,"n_cols":5,"rows_kept":79,"cut":false,"hidden":false,"merged":[[24,4,25,4],[1,0,1,4],[4,4,7,4],[8,4,11,4],[12,4,18,4],[19,4,23,4],[26,4,27,4],[51,4,56,4],[65,4,69,4],[78,0,78,1],[28,4,32,4],[39,4,41,4],[42,4,46,4],[47,4,50,4],[57,4,64,4],[33,4,38,4],[78,4,78,5]]}
[]
["Tab. 58 bis - Tabella di raccordo - DETTAGLIO ACQUISTI DI SERVIZI SANITARI IN MOBILITA'"]
[]
["Voce CE","Descrizione",null,"Importo","Voce CE D.Lgs. 118/2011 "]
["BA0410","B.2.A.1)   Acquisti servizi sanitari per medicina di base",null,{"$f":"SUM(D6:D8)","v":35655655.119999997},"B 2) a)"]
["BA0420","B.2.A.1.1) - da convenzione",null,{"$f":"SUMIF('00 CE'!B:B,'Tab 58 bis'!A6,'00 CE'!G:G)","v":35435849.350000001}]
["BA0470","B.2.A.1.2) - da pubblico (Aziende sanitarie pubbliche della Regione) - Mobilità intraregionale","a",{"$f":"SUMIF('00 CE'!B:B,'Tab 58 bis'!A7,'00 CE'!G:G)","v":35057.19}]
["BA0480","B.2.A.1.3) - da pubblico (Aziende sanitarie pubbliche Extraregione) - Mobilità extraregionale","b",{"$f":"SUMIF('00 CE'!B:B,'Tab 58 bis'!A8,'00 CE'!G:G)","v":184748.58}]
["BA0490","B.2.A.2)   Acquisti servizi sanitari per farmaceutica",null,{"$f":"SUM(D10:D12)","v":54563948.050000004},"B 2) b)"]
["BA0500","B.2.A.2.1) - da convenzione",null,{"$f":"SUMIF('00 CE'!B:B,'Tab 58 bis'!A10,'00 CE'!G:G)","v":52924145.520000003}]
["BA0510","B.2.A.2.2) - da pubblico (Aziende sanitarie pubbliche della Regione)- Mobilità intraregionale","a",{"$f":"SUMIF('00 CE'!B:B,'Tab 58 bis'!A11,'00 CE'!G:G)","v":1251970.51}]
["BA0520","B.2.A.2.3) - da pubblico (Extraregione)","b",{"$f":"SUMIF('00 CE'!B:B,'Tab 58 bis'!A12,'00 CE'!G:G)","v":387832.02}]
["BA0530","B.2.A.3)   Acquisti servizi sanitari per assistenza specialistica ambulatoriale",null,{"$f":"SUM(D14:D19)","v":27519184.069999997},"B 2) c)"]
["BA0540","B.2.A.3.1) - da pubblico (Aziende sanitarie pubbliche della Regione)","a",{"$f":"SUMIF('00 CE'!B:B,'Tab 58 bis'!A14,'00 CE'!G:G)","v":8998122.1099999994}]
["BA0550","B.2.A.3.2) - da pubblico (altri soggetti pubbl. della Regione)",null,{"$f":"SUMIF('00 CE'!B:B,'Tab 58 bis'!A15,'00 CE'!G:G)","v":189344.67}]
["BA0560","B.2.A.3.3) - da pubblico (Extraregione)","b",{"$f":"SUMIF('00 CE'!B:B,'Tab 58 bis'!A16,'00 CE'!G:G)","v":4460024.9400000004}]
["BA0570","B.2.A.3.4) - da privato - Medici SUMAI",null,{"$f":"SUMIF('00 CE'!B:B,'Tab 58 bis'!A17,'00 CE'!G:G)","v":4899151.05}]
["BA0580","B.2.A.3.5) - da privato",null,{"$f":"SUMIF('00 CE'!B:B,'Tab 58 bis'!A18,'00 CE'!G:G)","v":8757843.0999999996}]
["BA0630","B.2.A.3.6) - da privato per cittadini non residenti - Extraregione (mobilità attiva in compensazione)",null,{"$f":"SUMIF('00 CE'!B:B,'Tab 58 bis'!A19,'00 CE'!G:G)","v":214698.2}]
["BA0640","B.2.A.4)   Acquisti servizi sanitari per assistenza riabilitativa",null,{"$f":"SUM(D21:D24)","v":19907207.98},"B 2) d)"]
["BA0650","B.2.A.4.1) - da pubblico (Aziende sanitarie pubbliche della Regione)","a",{"$f":"SUMIF('00 CE'!B:B,'Tab 58 bis'!A21,'00 CE'!G:G)","v":4855060.17}]
["BA0670","B.2.A.4.3) - da pubblico (Extraregione) non soggetti a compensazione",null,{"$f":"SUMIF('00 CE'!B:B,'Tab 58 bis'!A22,'00 CE'!G:G)","v":0}]
["BA0680","B.2.A.4.4) - da privato (intraregionale)",null,{"$f":"SUMIF('00 CE'!B:B,'Tab 58 bis'!A23,'00 CE'!G:G)","v":14460769.459999999}]
["BA0690","B.2.A.4.5) - da privato (extraregionale)",null,{"$f":"SUMIF('00 CE'!B:B,'Tab 58 bis'!A24,'00 CE'!G:G)","v":591378.35}]
["BA0700","B.2.A.5)   Acquisti servizi sanitari per assistenza integrativa",null,{"$f":"SUM(D26:D26)","v":1813040.82},"B 2) e)"]
["BA0740","B.2.A.5.4) - da privato",null,{"$f":"SUMIF('00 CE'!B:B,'Tab 58 bis'!A26,'00 CE'!G:G)","v":1813040.82}]
["BA0750","B.2.A.6)   Acquisti servizi sanitari per assistenza protesica",null,{"$f":"SUM(D28)","v":6384295.54},"B 2) f)"]
["BA0790","B.2.A.6.4) - da privato",null,{"$f":"SUMIF('00 CE'!B:B,'Tab 58 bis'!A28,'00 CE'!G:G)","v":6384295.54}]
["BA0800","B.2.A.7)   Acquisti servizi sanitari per assistenza ospedaliera",null,{"$f":"SUM(D30:D33)","v":125006439.52000001},"B 2) g)"]
["BA0810","B.2.A.7.1) - da pubblico (Aziende sanitarie pubbliche della Regione)","a",{"$f":"SUMIF('00 CE'!B:B,'Tab 58 bis'!A30,'00 CE'!G:G)","v":28230091.68}]
["BA0830","B.2.A.7.3) - da pubblico (Extraregione)","b",{"$f":"SUMIF('00 CE'!B:B,'Tab 58 bis'!A31,'00 CE'!G:G)","v":23048879.050000001}]
["BA0840","B.2.A.7.4) - da privato",null,{"$f":"SUMIF('00 CE'!B:B,'Tab 58 bis'!A32,'00 CE'!G:G)","v":61809764.719999999}]
["BA0890","B.2.A.7.5) - da privato per cittadini non residenti - Extraregione (mobilità attiva in compensazione)",null,{"$f":"SUMIF('00 CE'!B:B,'Tab 58 bis'!A33,'00 CE'!G:G)","v":11917704.07}]
["BA0900","B.2.A.8)   Acquisto prestazioni di psichiatria residenziale e semiresidenziale",null,{"$f":"SUM(D35:D39)","v":13199111.060000001},"B 2) h)"]
["BA0910","B.2.A.8.1) - da pubblico (Aziende sanitarie pubbliche della Regione)","a",{"$f":"SUMIF('00 CE'!B:B,'Tab 58 bis'!A35,'00 CE'!G:G)","v":1648164.66}]
["BA0920","B.2.A.8.2) - da pubblico (altri soggetti pubbl. della Regione)",null,{"$f":"SUMIF('00 CE'!B:B,'Tab 58 bis'!A36,'00 CE'!G:G)","v":0}]
["BA0930","B.2.A.8.3) - da pubblico (Extraregione) - non soggette a compensazione",null,{"$f":"SUMIF('00 CE'!B:B,'Tab 58 bis'!A37,'00 CE'!G:G)","v":6667}]
["BA0940","B.2.A.8.4) - da privato (intraregionale)",null,{"$f":"SUMIF('00 CE'!B:B,'Tab 58 bis'!A38,'00 CE'!G:G)","v":9671880.5899999999}]
["BA0950","B.2.A.8.5) - da privato (extraregionale)",null,{"$f":"SUMIF('00 CE'!B:B,'Tab 58 bis'!A39,'00 CE'!G:G)","v":1872398.81}]
["BA0960","B.2.A.9)   Acquisto prestazioni di distribuzione farmaci File F",null,{"$f":"SUM(D41:D42)","v":5976832.0300000003},"B 2) i)"]
["BA0970","B.2.A.9.1) - da pubblico (Aziende sanitarie pubbliche della Regione) - Mobilità intraregionale","a",{"$f":"SUMIF('00 CE'!B:B,'Tab 58 bis'!A41,'00 CE'!G:G)","v":4391409.7}]
["BA0990","B.2.A.9.3) - da pubblico (Extraregione)","b",{"$f":"SUMIF('00 CE'!B:B,'Tab 58 bis'!A42,'00 CE'!G:G)","v":1585422.33}]
["BA1030","B.2.A.10)   Acquisto prestazioni termali in convenzione",null,{"$f":"SUM(D44:D47)","v":2288663.8299999996},"B 2) j)"]
["BA1040","B.2.A.10.1) - da pubblico (Aziende sanitarie pubbliche della Regione) - Mobilità intraregionale","a",{"$f":"SUMIF('00 CE'!B:B,'Tab 58 bis'!A44,'00 CE'!G:G)","v":0}]
["BA1060","B.2.A.10.3) - da pubblico (Extraregione)","b",{"$f":"SUMIF('00 CE'!B:B,'Tab 58 bis'!A45,'00 CE'!G:G)","v":159884.29}]
["BA1070","B.2.A.10.4) - da privato",null,{"$f":"SUMIF('00 CE'!B:B,'Tab 58 bis'!A46,'00 CE'!G:G)","v":1888589.9699999997}]
["BA1080","B.2.A.10.5) - da privato per cittadini non residenti - Extraregione (mobilità attiva in compensazione)",null,{"$f":"SUMIF('00 CE'!B:B,'Tab 58 bis'!A47,'00 CE'!G:G)","v":240189.57}]
["BA1090","B.2.A.11)   Acquisto prestazioni di trasporto sanitario",null,{"$f":"SUM(D49:D51)","v":8512737.8499999996},"B 2) k)"]
["BA1100","B.2.A.11.1) - da pubblico (Aziende sanitarie pubbliche della Regione) - Mobilità intraregionale","a",{"$f":"SUMIF('00 CE'!B:B,'Tab 58 bis'!A49,'00 CE'!G:G)","v":124342.79}]
["BA1120","B.2.A.11.3) - da pubblico (Extraregione)","b",{"$f":"SUMIF('00 CE'!B:B,'Tab 58 bis'!A50,'00 CE'!G:G)","v":228483.68}]
["BA1130","B.2.A.11.4) - da privato",null,{"$f":"SUMIF('00 CE'!B:B,'Tab 58 bis'!A51,'00 CE'!G:G)","v":8159911.3799999999}]
["BA1140","B.2.A.12)   Acquisto prestazioni Socio-Sanitarie a rilevanza sanitaria",null,{"$f":"SUM(D53:D57)","v":16209312.369999997},"B 2) l)"]
["BA1150","B.2.A.12.1) - da pubblico (Aziende sanitarie pubbliche della Regione) - Mobilità intraregionale","a",{"$f":"SUMIF('00 CE'!B:B,'Tab 58 bis'!A53,'00 CE'!G:G)","v":1737461.12}]
["BA1160","B.2.A.12.2) - da pubblico (altri soggetti pubblici della Regione)",null,{"$f":"SUMIF('00 CE'!B:B,'Tab 58 bis'!A54,'00 CE'!G:G)","v":0}]
["BA1170","B.2.A.12.3) - da pubblico (Extraregione) non soggette a compensazione",null,{"$f":"SUMIF('00 CE'!B:B,'Tab 58 bis'!A55,'00 CE'!G:G)","v":168459.48}]
["BA1180","B.2.A.12.4) - da privato (intraregionale)",null,{"$f":"SUMIF('00 CE'!B:B,'Tab 58 bis'!A56,'00 CE'!G:G)","v":12551624.019999998}]
["BA1190","B.2.A.12.5) - da privato (extraregionale)",null,{"$f":"SUMIF('00 CE'!B:B,'Tab 58 bis'!A57,'00 CE'!G:G)","v":1751767.75}]
["BA1200","B.2.A.13)  Compartecipazione al personale per att. libero-prof. (intramoenia)",null,{"$f":"SUM(D59:D65)","v":3293488.61},"B 2) m)"]
["BA1210","B.2.A.13.1)  Compartecipazione al personale per att. libero professionale intramoenia - Area ospedaliera",null,{"$f":"SUMIF('00 CE'!B:B,'Tab 58 bis'!A59,'00 CE'!G:G)","v":36801.340000000004}]
["BA1220","B.2.A.13.2)  Compartecipazione al personale per att. libero professionale intramoenia- Area specialistica",null,{"$f":"SUMIF('00 CE'!B:B,'Tab 58 bis'!A60,'00 CE'!G:G)","v":2790651.77}]
["BA1230","B.2.A.13.3)  Compartecipazione al personale per att. libero professionale intramoenia - Area sanità pubblica",null,{"$f":"SUMIF('00 CE'!B:B,'Tab 58 bis'!A61,'00 CE'!G:G)","v":19073.689999999999}]
["BA1240","B.2.A.13.4)  Compartecipazione al personale per att. libero professionale intramoenia - Consulenze (ex art. 55 c.1 lett. c), d) ed ex Art. 57-58)",null,{"$f":"SUMIF('00 CE'!B:B,'Tab 58 bis'!A62,'00 CE'!G:G)","v":371493.34}]
["BA1250","B.2.A.13.5)  Compartecipazione al personale per att. libero professionale intramoenia - Consulenze (ex art. 55 c.1 lett. c), d) ed ex Art. 57-58) (Aziende sanitarie pubbliche della Regione)",null,{"$f":"SUMIF('00 CE'!B:B,'Tab 58 bis'!A63,'00 CE'!G:G)","v":0}]
["BA1260","B.2.A.13.6)  Compartecipazione al personale per att. libero professionale intramoenia - Altro",null,{"$f":"SUMIF('00 CE'!B:B,'Tab 58 bis'!A64,'00 CE'!G:G)","v":75468.47}]
["BA1270","B.2.A.13.7)  Compartecipazione al personale per att. libero  professionale intramoenia - Altro (Aziende sanitarie pubbliche della Regione)",null,{"$f":"SUMIF('00 CE'!B:B,'Tab 58 bis'!A65,'00 CE'!G:G)","v":0}]
["BA1280","B.2.A.14)  Rimborsi, assegni e contributi sanitari",null,{"$f":"SUM(D67:D70)","v":1751188.4500000002},"B 2) n)"]
["BA1290","B.2.A.14.1)  Contributi ad associazioni di volontariato",null,{"$f":"SUMIF('00 CE'!B:B,'Tab 58 bis'!A67,'00 CE'!G:G)","v":326600}]
["BA1300","B.2.A.14.2)  Rimborsi per cure all'estero",null,{"$f":"SUMIF('00 CE'!B:B,'Tab 58 bis'!A68,'00 CE'!G:G)","v":0}]
["BA1330","B.2.A.14.5)  Altri rimborsi, assegni e contributi",null,{"$f":"SUMIF('00 CE'!B:B,'Tab 58 bis'!A69,'00 CE'!G:G)","v":1424508.4500000002}]
["BA1340","B.2.A.14.6)  Rimborsi, assegni e contributi v/Aziende sanitarie pubbliche della Regione",null,{"$f":"SUMIF('00 CE'!B:B,'Tab 58 bis'!A70,'00 CE'!G:G)","v":80}]
["BA1350","B.2.A.15)  Consulenze, Collaborazioni,  Interinale e altre prestazioni di lavoro sanitarie e sociosanitarie",null,{"$f":"SUMIF('00 CE'!B:B,'Tab 58 bis'!A71,'00 CE'!G:G)","v":6723251.46},"B 2) o)"]
["BA1490","B.2.A.16) Altri servizi sanitari e sociosanitari a rilevanza sanitaria",null,{"$f":"SUMIF('00 CE'!B:B,'Tab 58 bis'!A72,'00 CE'!G:G)","v":2754715.62},"B 2) p)"]
[]
["BA0400","Totale Acquisti servizi sanitari",null,{"$f":"D5+D9+D13+D20+D25+D27+D29+D34+D40+D43+D48+D52+D58+D66+D71+D72","v":331559072.38},"B.2"]
[]
["Somma a","Costi da mobilità sanitaria infraregionale",null,{"$f":"D7+D11+D14+D21+D30+D35+D41+D44+D49+D53","v":51271679.929999992}]
["Somma b","Costi da mobilità sanitaria extraregionale",null,{"$f":"D8+D12+D16+D31+D42+D45+D50","v":30055274.890000001}]
[]
["TOTALE COSTI DA MOBILITA' SANITARIA",null,null,{"$f":"D76+D77","v":81326954.819999993},"in accordo con Tabella n. 58 "]

{"sheet":"Tab 59-60","index":15,"n_rows":116,"n_cols":6,"rows_kept":116,"cut":false,"hidden":false,"merged":[[0,1,0,5],[1,0,2,0],[1,1,2,1],[1,2,2,2],[1,3,2,3],[1,4,2,4],[1,5,2,5],[72,1,72,5],[73,0,74,0],[73,1,74,1],[73,2,74,2],[73,3,74,3],[73,4,74,4],[73,5,74,5]]}
[null,"Tab. 59 – Dettaglio acquisti di servizi sanitari – I parte"]
["CODICE MOD. CE","DETTAGLIO ACQUISTI DI SERVIZI SANITARI",{"$f":"\"Valore CE \" &'00 Aggregatore'!$F$2","v":"Valore CE 2017"},{"$f":"\"Valore CE \" &'00 Aggregatore'!$F$2 -1","v":"Valore CE 2016"},"Variazioni\nimporto","Variazioni\n%"]
[]
[null,"ACQUISTI DI SERVIZI SANITARI - MEDICINA DI BASE",{"$f":"C5+C10+C11","v":35655655.119999997},{"$f":"D5+D10+D11","v":36146549.25},{"$f":"C4-D4","v":-490894.13000000268},{"$f":"IF(AND(C4=0,D4=0),0,IF(C4=0,\"\",IF(D4=0,\"\",E4/D4)))","v":-1.3580663719926257E-2}]
["BA0420","- da convenzione",{"$f":"SUMIF('00 CE'!$B:$B,$A5,'00 CE'!G:G)","v":35435849.350000001},{"$f":"SUMIF('00 CE'!$B:$B,$A5,'00 CE'!F:F)","v":35889765.890000001},{"$f":"C5-D5","v":-453916.53999999911},{"$f":"IF(AND(C5=0,D5=0),0,IF(C5=0,\"\",IF(D5=0,\"\",E5/D5)))","v":-1.2647520225994963E-2}]
["BA0430","Costi per assistenza MMG",{"$f":"SUMIF('00 CE'!$B:$B,$A6,'00 CE'!G:G)","v":24328709.329999998},{"$f":"SUMIF('00 CE'!$B:$B,$A6,'00 CE'!F:F)","v":24527412.66},{"$f":"C6-D6","v":-198703.33000000194},-8.1012756116772538E-3]
["BA0440","Costi per assistenza PLS",{"$f":"SUMIF('00 CE'!$B:$B,$A7,'00 CE'!G:G)","v":6208374.4000000004},{"$f":"SUMIF('00 CE'!$B:$B,$A7,'00 CE'!F:F)","v":6297522.9199999999},-89148.519999999553,-1.4156124738645581E-2]
["BA0450","Costi per assistenza Continuità assistenziale",{"$f":"SUMIF('00 CE'!$B:$B,$A8,'00 CE'!G:G)","v":4008916.53},{"$f":"SUMIF('00 CE'!$B:$B,$A8,'00 CE'!F:F)","v":4154724.75},-145808.2200000002,-3.5094555902891088E-2]
["BA0460","Altro (medicina dei servizi, psicologi, medici 118, ecc)",{"$f":"SUMIF('00 CE'!$B:$B,$A9,'00 CE'!G:G)","v":889849.09},{"$f":"SUMIF('00 CE'!$B:$B,$A9,'00 CE'!F:F)","v":910105.55999999994},-20256.469999999972,-2.2257275298922439E-2]
["BA0470","- da pubblico (Aziende sanitarie pubbliche della Regione) - Mobilità intraregionale",{"$f":"SUMIF('00 CE'!$B:$B,$A10,'00 CE'!G:G)","v":35057.19},{"$f":"SUMIF('00 CE'!$B:$B,$A10,'00 CE'!F:F)","v":83439.399999999994},-48382.209999999992,-0.57984848884340001]
["BA0480","- da pubblico (Aziende sanitarie pubbliche Extraregione) - Mobilità extraregionale",{"$f":"SUMIF('00 CE'!$B:$B,$A11,'00 CE'!G:G)","v":184748.58},{"$f":"SUMIF('00 CE'!$B:$B,$A11,'00 CE'!F:F)","v":173343.96},11404.619999999995,6.5791851068822904E-2]
[null,"ACQUISTI DI SERVIZI SANITARI - FARMACEUTICA",{"$f":"SUM(C13:C15)","v":54563948.050000004},{"$f":"SUM(D13:D15)","v":54637066.849999994},{"$f":"SUM(E13:E15)","v":-73118.799999995157},-1.3382636407026519E-3]
["BA0500","- da convenzione",{"$f":"SUMIF('00 CE'!$B:$B,$A13,'00 CE'!G:G)","v":52924145.520000003},{"$f":"SUMIF('00 CE'!$B:$B,$A13,'00 CE'!F:F)","v":53014279.899999999},{"$f":"C13-D13","v":-90134.379999995232},-1.7001905933649254E-3]
["BA0510","- da pubblico (Aziende sanitarie pubbliche della Regione)- Mobilità intraregionale",{"$f":"SUMIF('00 CE'!$B:$B,$A14,'00 CE'!G:G)","v":1251970.51},{"$f":"SUMIF('00 CE'!$B:$B,$A14,'00 CE'!F:F)","v":1241012.19},{"$f":"C14-D14","v":10958.320000000065},8.8301469464212648E-3]
["BA0520","- da pubblico (Extraregione)",{"$f":"SUMIF('00 CE'!$B:$B,$A15,'00 CE'!G:G)","v":387832.02},{"$f":"SUMIF('00 CE'!$B:$B,$A15,'00 CE'!F:F)","v":381774.76},{"$f":"C15-D15","v":6057.2600000000093},1.586605672936579E-2]
[null,"ACQUISTI DI SERVIZI SANITARI PER ASSITENZA SPECIALISTICA AMBULATORIALE",{"$f":"C17+C18+C19+C20+C21+C26","v":27519184.069999997},{"$f":"D17+D18+D19+D20+D21+D26","v":25704713.989999998},{"$f":"C16-D16","v":1814470.0799999982},7.0589000939901073E-2]
["BA0540","- da pubblico (Aziende sanitarie pubbliche della Regione)",{"$f":"SUMIF('00 CE'!$B:$B,$A17,'00 CE'!G:G)","v":8998122.1099999994},{"$f":"SUMIF('00 CE'!$B:$B,$A17,'00 CE'!F:F)","v":8524168.6600000001},473953.44999999925,5.5601134715229726E-2]
["BA0550","- da pubblico (altri soggetti pubbl. della Regione)",{"$f":"SUMIF('00 CE'!$B:$B,$A18,'00 CE'!G:G)","v":189344.67},{"$f":"SUMIF('00 CE'!$B:$B,$A18,'00 CE'!F:F)","v":224364.91},-35020.239999999991,-0.15608608315801251]
["BA0560","- da pubblico (Extraregione)",{"$f":"SUMIF('00 CE'!$B:$B,$A19,'00 CE'!G:G)","v":4460024.9400000004},{"$f":"SUMIF('00 CE'!$B:$B,$A19,'00 CE'!F:F)","v":3048586.34},1411438.6000000006,0.46298134367419641]
["BA0570","- da privato - Medici SUMAI",{"$f":"SUMIF('00 CE'!$B:$B,$A20,'00 CE'!G:G)","v":4899151.05},{"$f":"SUMIF('00 CE'!$B:$B,$A20,'00 CE'!F:F)","v":5114503.17},-215352.12000000011,-4.2106166100978309E-2]
["BA0580","- da privato",{"$f":"SUMIF('00 CE'!$B:$B,$A21,'00 CE'!G:G)","v":8757843.0999999996},{"$f":"SUMIF('00 CE'!$B:$B,$A21,'00 CE'!F:F)","v":8596847.0599999987},160996.04000000097,1.872733560064066E-2]
["BA0590","Servizi sanitari per assistenza specialistica da IRCCS privati e Policlinici privati",{"$f":"SUMIF('00 CE'!$B:$B,$A22,'00 CE'!G:G)","v":60978.73},{"$f":"SUMIF('00 CE'!$B:$B,$A22,'00 CE'!F:F)","v":44362.83},16615.900000000001,0.3745455373338446]
["BA0600","Servizi sanitari per assistenza specialistica da Ospedali Classificati privati",{"$f":"SUMIF('00 CE'!$B:$B,$A23,'00 CE'!G:G)","v":0},{"$f":"SUMIF('00 CE'!$B:$B,$A23,'00 CE'!F:F)","v":0},0,0]
["BA0610","Servizi sanitari per assistenza specialistica da Case di Cura private",{"$f":"SUMIF('00 CE'!$B:$B,$A24,'00 CE'!G:G)","v":5412858.8699999992},{"$f":"SUMIF('00 CE'!$B:$B,$A24,'00 CE'!F:F)","v":5364433.0199999996},48425.849999999627,9.0272075016046404E-3]
["BA0620","Servizi sanitari per assistenza specialistica da altri privati",{"$f":"SUMIF('00 CE'!$B:$B,$A25,'00 CE'!G:G)","v":3284005.5},{"$f":"SUMIF('00 CE'!$B:$B,$A25,'00 CE'!F:F)","v":3188051.21},95954.290000000037,3.009810184322605E-2]
["BA0630","- da privato per cittadini non residenti - Extraregione (mobilità attiva in compensazione)",{"$f":"SUMIF('00 CE'!$B:$B,$A26,'00 CE'!G:G)","v":214698.2},{"$f":"SUMIF('00 CE'!$B:$B,$A26,'00 CE'!F:F)","v":196243.84999999998},18454.350000000035,9.403785137725354E-2]
[null,"ACQUISTI DI SERVIZI SANITARI PER ASSISTENZA RIABILITATIVA",{"$f":"SUM(C28:C32)","v":19907207.98},{"$f":"SUM(D28:D32)","v":19761859.140000001},145348.83999999985,7.3550185218049201E-3]
["BA0650","- da pubblico (Aziende sanitarie pubbliche della Regione)",{"$f":"SUMIF('00 CE'!$B:$B,$A28,'00 CE'!G:G)","v":4855060.17},{"$f":"SUMIF('00 CE'!$B:$B,$A28,'00 CE'!F:F)","v":4525129.8},329930.37000000011,7.2910697500876129E-2]
["BA0660","- da pubblico (altri soggetti pubbl. della Regione)",{"$f":"SUMIF('00 CE'!$B:$B,$A29,'00 CE'!G:G)","v":0},{"$f":"SUMIF('00 CE'!$B:$B,$A29,'00 CE'!F:F)","v":0},0,0]
["BA0670","- da pubblico (Extraregione) non soggetti a compensazione",{"$f":"SUMIF('00 CE'!$B:$B,$A30,'00 CE'!G:G)","v":0},{"$f":"SUMIF('00 CE'!$B:$B,$A30,'00 CE'!F:F)","v":0},0,0]
["BA0680","- da privato (intraregionale)",{"$f":"SUMIF('00 CE'!$B:$B,$A31,'00 CE'!G:G)","v":14460769.459999999},{"$f":"SUMIF('00 CE'!$B:$B,$A31,'00 CE'!F:F)","v":14443763.359999999},17006.099999999627,1.1774009014226627E-3]
["BA0690","- da privato (extraregionale)",{"$f":"SUMIF('00 CE'!$B:$B,$A32,'00 CE'!G:G)","v":591378.35},{"$f":"SUMIF('00 CE'!$B:$B,$A32,'00 CE'!F:F)","v":792965.98},-201587.63,-0.25421977119371503]
[null,"ACQUISTI DI SERVIZI SANITARI PER ASSISTENZA INTEGRATIVA",{"$f":"SUM(C34:C37)","v":1813040.82},{"$f":"SUM(D34:D37)","v":1692964.4},120076.42000000016,7.0926724743887212E-2]
["BA0710","- da pubblico (Aziende sanitarie pubbliche della Regione)",{"$f":"SUMIF('00 CE'!$B:$B,$A34,'00 CE'!G:G)","v":0},{"$f":"SUMIF('00 CE'!$B:$B,$A34,'00 CE'!F:F)","v":0},0,0]
["BA0720","- da pubblico (altri soggetti pubbl. della Regione)",{"$f":"SUMIF('00 CE'!$B:$B,$A35,'00 CE'!G:G)","v":0},{"$f":"SUMIF('00 CE'!$B:$B,$A35,'00 CE'!F:F)","v":0},0,0]
["BA0730","- da pubblico (Extraregione)",{"$f":"SUMIF('00 CE'!$B:$B,$A36,'00 CE'!G:G)","v":0},{"$f":"SUMIF('00 CE'!$B:$B,$A36,'00 CE'!F:F)","v":0},0,0]
["BA0740","- da privato",{"$f":"SUMIF('00 CE'!$B:$B,$A37,'00 CE'!G:G)","v":1813040.82},{"$f":"SUMIF('00 CE'!$B:$B,$A37,'00 CE'!F:F)","v":1692964.4},120076.42000000016,7.0926724743887212E-2]
[null,"ACQUISTI DI SERVIZI SANITARI PER ASSISTENZA PROTESICA",{"$f":"SUM(C39:C42)","v":6384295.54},{"$f":"SUM(D39:D42)","v":6610863.3500000006},-226567.81000000052,-3.4272045571778535E-2]
["BA0760","- da pubblico (Aziende sanitarie pubbliche della Regione)",{"$f":"SUMIF('00 CE'!$B:$B,$A39,'00 CE'!G:G)","v":0},{"$f":"SUMIF('00 CE'!$B:$B,$A39,'00 CE'!F:F)","v":0},0,0]
["BA0770","- da pubblico (altri soggetti pubbl. della Regione)",{"$f":"SUMIF('00 CE'!$B:$B,$A40,'00 CE'!G:G)","v":0},{"$f":"SUMIF('00 CE'!$B:$B,$A40,'00 CE'!F:F)","v":0},0,0]
["BA0780","- da pubblico (Extraregione)",{"$f":"SUMIF('00 CE'!$B:$B,$A41,'00 CE'!G:G)","v":0},{"$f":"SUMIF('00 CE'!$B:$B,$A41,'00 CE'!F:F)","v":0},0,0]
["BA0790","- da privato",{"$f":"SUMIF('00 CE'!$B:$B,$A42,'00 CE'!G:G)","v":6384295.54},{"$f":"SUMIF('00 CE'!$B:$B,$A42,'00 CE'!F:F)","v":6610863.3500000006},-226567.81000000052,-3.4272045571778535E-2]
[null,"ACQUISTI DI SERVIZI SANITARI PER ASSISTENZA OSPEDALIERA",{"$f":"C44+C45+C46+C47+C52","v":125006439.52000001},{"$f":"D44+D45+D46+D47+D52","v":124912983.22},93456.300000011921,7.4817122760901687E-4]
["BA0810","- da pubblico (Aziende sanitarie pubbliche della Regione)",{"$f":"SUMIF('00 CE'!$B:$B,$A44,'00 CE'!G:G)","v":28230091.68},{"$f":"SUMIF('00 CE'!$B:$B,$A44,'00 CE'!F:F)","v":28209224.370000001},20867.309999998659,7.3973356113224669E-4]
["BA0820","- da pubblico (altri soggetti pubbl. della Regione)",{"$f":"SUMIF('00 CE'!$B:$B,$A45,'00 CE'!G:G)","v":0},{"$f":"SUMIF('00 CE'!$B:$B,$A45,'00 CE'!F:F)","v":0},0,0]
["BA0830","- da pubblico (Extraregione)",{"$f":"SUMIF('00 CE'!$B:$B,$A46,'00 CE'!G:G)","v":23048879.050000001},{"$f":"SUMIF('00 CE'!$B:$B,$A46,'00 CE'!F:F)","v":23636269.289999999},-587390.23999999836,-2.4851224734036628E-2]
["BA0840","- da privato",{"$f":"SUMIF('00 CE'!$B:$B,$A47,'00 CE'!G:G)","v":61809764.719999999},{"$f":"SUMIF('00 CE'!$B:$B,$A47,'00 CE'!F:F)","v":61570511.920000002},239252.79999999702,3.8858341848913608E-3]
["BA0850","Servizi sanitari per assistenza ospedaliera da IRCCS privati e Policlinici privati",{"$f":"SUMIF('00 CE'!$B:$B,$A48,'00 CE'!G:G)","v":0},{"$f":"SUMIF('00 CE'!$B:$B,$A48,'00 CE'!F:F)","v":0},0,0]
["BA0860","Servizi sanitari per assistenza ospedaliera da Ospedali Classificati privati",{"$f":"SUMIF('00 CE'!$B:$B,$A49,'00 CE'!G:G)","v":0},{"$f":"SUMIF('00 CE'!$B:$B,$A49,'00 CE'!F:F)","v":0},0,0]
["BA0870","Servizi sanitari per assistenza ospedaliera da Case di Cura private",{"$f":"SUMIF('00 CE'!$B:$B,$A50,'00 CE'!G:G)","v":61809764.719999999},{"$f":"SUMIF('00 CE'!$B:$B,$A50,'00 CE'!F:F)","v":61570511.920000002},239252.79999999702,3.8858341848913608E-3]
["BA0880","Servizi sanitari per assistenza ospedaliera da altri privati",{"$f":"SUMIF('00 CE'!$B:$B,$A51,'00 CE'!G:G)","v":0},{"$f":"SUMIF('00 CE'!$B:$B,$A51,'00 CE'!F:F)","v":0},0,0]
["BA0890","- da privato per cittadini non residenti - Extraregione (mobilità attiva in compensazione)",{"$f":"SUMIF('00 CE'!$B:$B,$A52,'00 CE'!G:G)","v":11917704.07},{"$f":"SUMIF('00 CE'!$B:$B,$A52,'00 CE'!F:F)","v":11496977.640000001},420726.4299999997,3.6594524506703287E-2]
[null,"ACQUISTI PRESTAZIONI DI PSICHIATRICA RESIDENZIALE E SEMIRESIDENZIALE",{"$f":"SUM(C54:C58)","v":13199111.060000001},{"$f":"SUM(D54:D58)","v":13567821.24},-368710.1799999997,-2.7175341823710501E-2]
["BA0910","- da pubblico (Aziende sanitarie pubbliche della Regione)",{"$f":"SUMIF('00 CE'!$B:$B,$A54,'00 CE'!G:G)","v":1648164.66},{"$f":"SUMIF('00 CE'!$B:$B,$A54,'00 CE'!F:F)","v":1713800.54},-65635.880000000121,-3.8298435826143527E-2]
["BA0920","- da pubblico (altri soggetti pubbl. della Regione)",{"$f":"SUMIF('00 CE'!$B:$B,$A55,'00 CE'!G:G)","v":0},{"$f":"SUMIF('00 CE'!$B:$B,$A55,'00 CE'!F:F)","v":0},0,0]
["BA0930","- da pubblico (Extraregione) - non soggette a compensazione",{"$f":"SUMIF('00 CE'!$B:$B,$A56,'00 CE'!G:G)","v":6667},{"$f":"SUMIF('00 CE'!$B:$B,$A56,'00 CE'!F:F)","v":32900.5},-26233.5,-0.79735870275527732]
["BA0940","- da privato (intraregionale)",{"$f":"SUMIF('00 CE'!$B:$B,$A57,'00 CE'!G:G)","v":9671880.5899999999},{"$f":"SUMIF('00 CE'!$B:$B,$A57,'00 CE'!F:F)","v":9642524.2799999993},29356.310000000522,3.0444631662364372E-3]
["BA0950","- da privato (extraregionale)",{"$f":"SUMIF('00 CE'!$B:$B,$A58,'00 CE'!G:G)","v":1872398.81},{"$f":"SUMIF('00 CE'!$B:$B,$A58,'00 CE'!F:F)","v":2178595.92},-306197.10999999987,-0.14054791307972334]
[null,"ACQUISTI PRESTAZIONI DI DISTRIBUZIONE FARMACI FILE F",{"$f":"SUM(C60:C65)","v":5976832.0300000003},{"$f":"SUM(D60:D65)","v":6195810.8599999994},-218978.82999999914,-3.5343046285308842E-2]
["BA0970","- da pubblico (Aziende sanitarie pubbliche della Regione) - Mobilità intraregionale",{"$f":"SUMIF('00 CE'!$B:$B,$A60,'00 CE'!G:G)","v":4391409.7},{"$f":"SUMIF('00 CE'!$B:$B,$A60,'00 CE'!F:F)","v":5023688.8099999996},-632279.1099999994,-0.12585952950377902]
["BA0980","- da pubblico (altri soggetti pubbl. della Regione)",{"$f":"SUMIF('00 CE'!$B:$B,$A61,'00 CE'!G:G)","v":0},{"$f":"SUMIF('00 CE'!$B:$B,$A61,'00 CE'!F:F)","v":0},0,0]
["BA0990","- da pubblico (Extraregione)",{"$f":"SUMIF('00 CE'!$B:$B,$A62,'00 CE'!G:G)","v":1585422.33},{"$f":"SUMIF('00 CE'!$B:$B,$A62,'00 CE'!F:F)","v":1172122.05},413300.28,0.35260857007169177]
["BA1000","- da privato (intraregionale)",{"$f":"SUMIF('00 CE'!$B:$B,$A63,'00 CE'!G:G)","v":0},{"$f":"SUMIF('00 CE'!$B:$B,$A63,'00 CE'!F:F)","v":0},0,0]
["BA1010","- da privato (extraregionale)",{"$f":"SUMIF('00 CE'!$B:$B,$A64,'00 CE'!G:G)","v":0},{"$f":"SUMIF('00 CE'!$B:$B,$A64,'00 CE'!F:F)","v":0},0,0]
["BA1020","- da privato per cittadini non residenti - Extraregione (mobilità attiva in compensazione)",{"$f":"SUMIF('00 CE'!$B:$B,$A65,'00 CE'!G:G)","v":0},{"$f":"SUMIF('00 CE'!$B:$B,$A65,'00 CE'!F:F)","v":0},0,0]
[null,"ACQUISTI PRESTAZIONI TERMALI IN CONVENZIONE",{"$f":"SUM(C67:C71)","v":2288663.8299999996},{"$f":"SUM(D67:D71)","v":2454064.39},-165400.56000000052,-6.7398622739479344E-2]
["BA1040","- da pubblico (Aziende sanitarie pubbliche della Regione) - Mobilità intraregionale",{"$f":"SUMIF('00 CE'!$B:$B,$A67,'00 CE'!G:G)","v":0},{"$f":"SUMIF('00 CE'!$B:$B,$A67,'00 CE'!F:F)","v":46.2},-46.2,""]
["BA1050","- da pubblico (altri soggetti pubbl. della Regione)",{"$f":"SUMIF('00 CE'!$B:$B,$A68,'00 CE'!G:G)","v":0},{"$f":"SUMIF('00 CE'!$B:$B,$A68,'00 CE'!F:F)","v":0},0,0]
["BA1060","- da pubblico (Extraregione)",{"$f":"SUMIF('00 CE'!$B:$B,$A69,'00 CE'!G:G)","v":159884.29},{"$f":"SUMIF('00 CE'!$B:$B,$A69,'00 CE'!F:F)","v":199293.42},{"$f":"C69-D69","v":-39409.130000000005},{"$f":"IF(AND(C69=0,D69=0),0,IF(C69=0,\"\",IF(D69=0,\"\",E69/D69)))","v":-0.19774426069862217}]
["BA1070","- da privato",{"$f":"SUMIF('00 CE'!$B:$B,$A70,'00 CE'!G:G)","v":1888589.9699999997},{"$f":"SUMIF('00 CE'!$B:$B,$A70,'00 CE'!F:F)","v":1994460.87},{"$f":"C70-D70","v":-105870.90000000037},-5.3082465338114337E-2]
["BA1080","- da privato per cittadini non residenti - Extraregione (mobilità attiva in compensazione)",{"$f":"SUMIF('00 CE'!$B:$B,$A71,'00 CE'!G:G)","v":240189.57},{"$f":"SUMIF('00 CE'!$B:$B,$A71,'00 CE'!F:F)","v":260263.90000000002},{"$f":"C71-D71","v":-20074.330000000016},-7.7130673904448582E-2]
[]
[null,"Tab. 60 – Dettaglio acquisti di servizi sanitari – II parte"]
["CODICE MOD. CE","DETTAGLIO ACQUISTI DI SERVIZI SANITARI",{"$f":"\"Valore CE \" &'00 Aggregatore'!$F$2","v":"Valore CE 2017"},{"$f":"\"Valore CE \" &'00 Aggregatore'!$F$2 -1","v":"Valore CE 2016"},"Variazioni\nimporto","Variazioni\n%"]
[]
[null,"ACQUISTI PRESTAZIONI DI TRASPORTO SANITARIO",{"$f":"SUM(C77:C80)","v":8512737.8499999996},{"$f":"SUM(D77:D80)","v":7430925.1600000001},{"$f":"C76-D76","v":1081812.6899999995},{"$f":"IF(AND(C76=0,D76=0),0,IF(C76=0,\"\",IF(D76=0,\"\",E76/D76)))","v":0.14558250375381246}]
["BA1100","- da pubblico (Aziende sanitarie pubbliche della Regione) - Mobilità intraregionale",{"$f":"SUMIF('00 CE'!$B:$B,$A77,'00 CE'!G:G)","v":124342.79},{"$f":"SUMIF('00 CE'!$B:$B,$A77,'00 CE'!F:F)","v":76616.539999999994},47726.25,0.62292358803986714]
["BA1110","- da pubblico (altri soggetti pubbl. della Regione)",{"$f":"SUMIF('00 CE'!$B:$B,$A78,'00 CE'!G:G)","v":0},{"$f":"SUMIF('00 CE'!$B:$B,$A78,'00 CE'!F:F)","v":0},0,0]
["BA1120","- da pubblico (Extraregione)",{"$f":"SUMIF('00 CE'!$B:$B,$A79,'00 CE'!G:G)","v":228483.68},{"$f":"SUMIF('00 CE'!$B:$B,$A79,'00 CE'!F:F)","v":91959.29},136524.39000000001,1.4846177042036757]
["BA1130","- da privato",{"$f":"SUMIF('00 CE'!$B:$B,$A80,'00 CE'!G:G)","v":8159911.3799999999},{"$f":"SUMIF('00 CE'!$B:$B,$A80,'00 CE'!F:F)","v":7262349.3300000001},897562.04999999981,0.12359114237210617]
[null,"ACQUISTI PRESTAZIONI  SOCIO-SANITARIE A RILEVANZA SANITARIA",{"$f":"SUM(C82:C86)","v":16209312.369999997},{"$f":"SUM(D82:D86)","v":16691623.420000002},-482311.05000000447,-2.8895394885442748E-2]
["BA1150","- da pubblico (Aziende sanitarie pubbliche della Regione) - Mobilità intraregionale",{"$f":"SUMIF('00 CE'!$B:$B,$A82,'00 CE'!G:G)","v":1737461.12},{"$f":"SUMIF('00 CE'!$B:$B,$A82,'00 CE'!F:F)","v":1929611.4},-192150.2799999998,-9.9579780675010415E-2]
["BA1160","- da pubblico (altri soggetti pubblici della Regione)",{"$f":"SUMIF('00 CE'!$B:$B,$A83,'00 CE'!G:G)","v":0},{"$f":"SUMIF('00 CE'!$B:$B,$A83,'00 CE'!F:F)","v":0},0,0]
["BA1170","- da pubblico (Extraregione) non soggette a compensazione",{"$f":"SUMIF('00 CE'!$B:$B,$A84,'00 CE'!G:G)","v":168459.48},{"$f":"SUMIF('00 CE'!$B:$B,$A84,'00 CE'!F:F)","v":334811.51},-166352.03,-0.49685278143514239]
["BA1180","- da privato (intraregionale)",{"$f":"SUMIF('00 CE'!$B:$B,$A85,'00 CE'!G:G)","v":12551624.019999998},{"$f":"SUMIF('00 CE'!$B:$B,$A85,'00 CE'!F:F)","v":12820370.060000001},-268746.04000000283,-2.0962424543305484E-2]
["BA1190","- da privato (extraregionale)",{"$f":"SUMIF('00 CE'!$B:$B,$A86,'00 CE'!G:G)","v":1751767.75},{"$f":"SUMIF('00 CE'!$B:$B,$A86,'00 CE'!F:F)","v":1606830.4500000002},144937.29999999981,9.0200742710595139E-2]
["BA1200","COMPARTECIPAZIONE AL PERSONALE PER ATT. LIBERO-PROF. (INTRAMOENIA)",{"$f":"SUMIF('00 CE'!$B:$B,$A87,'00 CE'!G:G)","v":3293488.61},{"$f":"SUMIF('00 CE'!$B:$B,$A87,'00 CE'!F:F)","v":3292642.6900000004},{"$f":"C87-D87","v":845.91999999945983},2.5691217652270057E-4]
[null,"RIMBORSI ASSEGNI E CONTRIBUTI SANITARI",{"$f":"SUM(C89:C94)","v":1751188.4500000002},{"$f":"SUM(D89:D94)","v":2158483.7199999997},-407295.26999999955,-0.18869508545563624]
["BA1290","Contributi ad associazioni di volontariato",{"$f":"SUMIF('00 CE'!$B:$B,$A89,'00 CE'!G:G)","v":326600},{"$f":"SUMIF('00 CE'!$B:$B,$A89,'00 CE'!F:F)","v":473982},-147382,-0.31094429746277286]
["BA1300","Rimborsi per cure all'estero",{"$f":"SUMIF('00 CE'!$B:$B,$A90,'00 CE'!G:G)","v":0},{"$f":"SUMIF('00 CE'!$B:$B,$A90,'00 CE'!F:F)","v":15911.61},-15911.61,""]
["BA1310","Contributi a società partecipate e/o enti dipendenti della Regione",{"$f":"SUMIF('00 CE'!$B:$B,$A91,'00 CE'!G:G)","v":0},{"$f":"SUMIF('00 CE'!$B:$B,$A91,'00 CE'!F:F)","v":0},0,0]
["BA1320","Contributo Legge 210/92",{"$f":"SUMIF('00 CE'!$B:$B,$A92,'00 CE'!G:G)","v":0},{"$f":"SUMIF('00 CE'!$B:$B,$A92,'00 CE'!F:F)","v":0},0,0]
["BA1330","Altri rimborsi, assegni e contributi",{"$f":"SUMIF('00 CE'!$B:$B,$A93,'00 CE'!G:G)","v":1424508.4500000002},{"$f":"SUMIF('00 CE'!$B:$B,$A93,'00 CE'!F:F)","v":1482389.1099999999},-57880.659999999683,-3.9045524288828383E-2]
["BA1340","Rimborsi, assegni e contributi v/Aziende sanitarie pubbliche della Regione",{"$f":"SUMIF('00 CE'!$B:$B,$A94,'00 CE'!G:G)","v":80},{"$f":"SUMIF('00 CE'!$B:$B,$A94,'00 CE'!F:F)","v":186201},-186121,-0.99957035676500128]
[null,"CONSULENZE, COLLABORAZIONI, INTERINALE, ALTRE PRESTAZIONI DI LAVORO SANITARIE E SOCIOSANITARIE",{"$f":"SUM(C96:C98)+C108","v":6723251.46},{"$f":"SUM(D96:D98)+D108","v":6203271.4700000007},{"$f":"SUM(E96:E98)+E108","v":519979.98999999929},8.3823510306570426E-2]
["BA1360","Consulenze sanitarie e sociosan. da Aziende sanitarie pubbliche della Regione",{"$f":"SUMIF('00 CE'!$B:$B,$A96,'00 CE'!G:G)","v":298526.69},{"$f":"SUMIF('00 CE'!$B:$B,$A96,'00 CE'!F:F)","v":368369.4},-69842.710000000021,-0.18959965187119238]
["BA1370","Consulenze sanitarie e sociosanit. da terzi - Altri soggetti pubblici",{"$f":"SUMIF('00 CE'!$B:$B,$A97,'00 CE'!G:G)","v":24433.75},{"$f":"SUMIF('00 CE'!$B:$B,$A97,'00 CE'!F:F)","v":90118.47},-65684.72,-0.72887078531182348]
["BA1380","Consulenze, Collaborazioni, Interinale e altre prestazioni di lavoro sanitarie e socios. da privato",{"$f":"SUMIF('00 CE'!$B:$B,$A98,'00 CE'!G:G)","v":6390500.9299999997},{"$f":"SUMIF('00 CE'!$B:$B,$A98,'00 CE'!F:F)","v":5703679.1500000004},686821.77999999933,0.12041732396535651]
["BA1390","Consulenze sanitarie da privato - articolo 55, comma 2, CCNL 8 giugno 2000",{"$f":"SUMIF('00 CE'!$B:$B,$A99,'00 CE'!G:G)","v":2372315.1800000002},{"$f":"SUMIF('00 CE'!$B:$B,$A99,'00 CE'!F:F)","v":2656011.58},-283696.39999999991,-0.106812937916483]
["BA1400","Altre consulenze sanitarie e sociosanitarie da privato",{"$f":"SUMIF('00 CE'!$B:$B,$A100,'00 CE'!G:G)","v":8005.29},{"$f":"SUMIF('00 CE'!$B:$B,$A100,'00 CE'!F:F)","v":9289.34},-1284.0500000000002,-0.13822833484402552]
["BA1410","Collaborazioni coordinate e continuative sanitarie e socios. da privato",{"$f":"SUMIF('00 CE'!$B:$B,$A101,'00 CE'!G:G)","v":8413.1200000000008},{"$f":"SUMIF('00 CE'!$B:$B,$A101,'00 CE'!F:F)","v":13270.74},-4857.619999999999,-0.366039874189382]
["BA1420","Indennità a personale universitario - area sanitaria ",{"$f":"SUMIF('00 CE'!$B:$B,$A102,'00 CE'!G:G)","v":242210.34},{"$f":"SUMIF('00 CE'!$B:$B,$A102,'00 CE'!F:F)","v":252571.97},-10361.630000000005,-4.1024465224704092E-2]
["BA1430","Lavoro interinale - area sanitaria ",{"$f":"SUMIF('00 CE'!$B:$B,$A103,'00 CE'!G:G)","v":2608784.9},{"$f":"SUMIF('00 CE'!$B:$B,$A103,'00 CE'!F:F)","v":1558908.64},1049876.26,0.67346875439730713]
["BA1440","Altre collaborazioni e prestazioni di lavoro - area sanitaria ",{"$f":"SUMIF('00 CE'!$B:$B,$A104,'00 CE'!G:G)","v":1150772.0999999999},{"$f":"SUMIF('00 CE'!$B:$B,$A104,'00 CE'!F:F)","v":1213626.8799999999},-62854.780000000028,-5.1790860136519089E-2]
["BA1450","Rimborso oneri stipendiali del personale sanitario in comando",{"$f":"SUMIF('00 CE'!$B:$B,$A105,'00 CE'!G:G)","v":9790.09},{"$f":"SUMIF('00 CE'!$B:$B,$A105,'00 CE'!F:F)","v":41104.449999999997},-31314.359999999997,-0.76182408474021668]
["BA1460","Rimborso oneri stipendiali personale sanitario in comando da Aziende sanitarie pubbliche della Regione",{"$f":"SUMIF('00 CE'!$B:$B,$A106,'00 CE'!G:G)","v":0},{"$f":"SUMIF('00 CE'!$B:$B,$A106,'00 CE'!F:F)","v":0},0,0]
["BA1470","Rimborso oneri stipendiali personale sanitario in comando da Regioni, soggetti pubblici e da Università",{"$f":"SUMIF('00 CE'!$B:$B,$A107,'00 CE'!G:G)","v":0},{"$f":"SUMIF('00 CE'!$B:$B,$A107,'00 CE'!F:F)","v":0},0,0]
["BA1480","Rimborso oneri stipendiali personale sanitario in comando da aziende di altre Regioni (Extraregione)",{"$f":"SUMIF('00 CE'!$B:$B,$A108,'00 CE'!G:G)","v":9790.09},{"$f":"SUMIF('00 CE'!$B:$B,$A108,'00 CE'!F:F)","v":41104.449999999997},-31314.359999999997,-0.76182408474021668]
[null,"ALTRI SERVIZI SANITARI E SOCIOSANITARI A RILEVANZA SANITARIA",{"$f":"SUM(C110:C114)","v":2754715.62},{"$f":"SUM(D110:D114)","v":2513700.4700000002},241015.14999999991,9.5880616197680818E-2]
["BA1500","Altri servizi sanitari e sociosanitari a rilevanza sanitaria da pubblico - Aziende sanitarie pubbliche della Regione",{"$f":"SUMIF('00 CE'!$B:$B,$A110,'00 CE'!G:G)","v":13109.54},{"$f":"SUMIF('00 CE'!$B:$B,$A110,'00 CE'!F:F)","v":50483.02},-37373.479999999996,-0.7403178336002878]
["BA1510","Altri servizi sanitari e sociosanitari a rilevanza sanitaria da pubblico - Altri soggetti pubblici della Regione",{"$f":"SUMIF('00 CE'!$B:$B,$A111,'00 CE'!G:G)","v":0},{"$f":"SUMIF('00 CE'!$B:$B,$A111,'00 CE'!F:F)","v":0},0,0]
["BA1520","Altri servizi sanitari e sociosanitari a rilevanza sanitaria da pubblico (Extraregione)",{"$f":"SUMIF('00 CE'!$B:$B,$A112,'00 CE'!G:G)","v":0},{"$f":"SUMIF('00 CE'!$B:$B,$A112,'00 CE'!F:F)","v":0},0,0]
["BA1530","Altri servizi sanitari da privato",{"$f":"SUMIF('00 CE'!$B:$B,$A113,'00 CE'!G:G)","v":2741606.08},{"$f":"SUMIF('00 CE'!$B:$B,$A113,'00 CE'!F:F)","v":2463217.4500000002},278388.62999999989,0.11301829239639394]
["BA1540","Costi per servizi sanitari - Mobilità internazionale passiva",{"$f":"SUMIF('00 CE'!$B:$B,$A114,'00 CE'!G:G)","v":0},{"$f":"SUMIF('00 CE'!$B:$B,$A114,'00 CE'!F:F)","v":0},0,0]
["BA1550","COSTI PER DIFFERENZIALE TARIFFE TUC",{"$f":"SUMIF('00 CE'!$B:$B,$A115,'00 CE'!G:G)","v":0},{"$f":"SUMIF('00 CE'!$B:$B,$A115,'00 CE'!F:F)","v":0},0,0]
[null,"TOTALE",{"$f":"C66+C59+C53+C43+C38+C33+C27+C16+C12+C4+C76+C81+C87+C88+C95+C109+C115","v":331559072.38},{"$f":"D66+D59+D53+D43+D38+D33+D27+D16+D12+D4+D76+D81+D87+D88+D95+D109+D115","v":329975343.62000018},1583728.7600000065,4.7995366642418881E-3]

{"sheet":"Farmaceutica Convenzionata","index":16,"n_rows":49,"n_cols":7,"rows_kept":49,"cut":false,"hidden":false,"merged":[[17,0,17,6],[0,0,0,6],[4,0,4,1],[14,0,14,6],[15,0,15,6],[16,0,16,6],[23,0,23,6],[24,0,24,6],[18,0,18,6],[19,0,19,6],[20,0,20,6],[21,0,21,6]]}
["DETTAGLIO SPESA FARMACEUTICA CONVENZIONATA"]
[]
[]
[]
["Spesa Farmaceutica Convenzionata \nConsuntivo 2016"]
["Spesa farmaceutica netta",52765815.090000004]
["Contributo ENFAP",30403.759999999998]
["Contributi a farmacie rurali",127926.47]
[" Altro (*) "]
["TOTALE  ",{"$f":"SUM(B6:B9)","v":52924145.32}]
["valori in €"]
[]
["TICKET - DECRETO COMMISSARIALE N. 103 DEL 21/09/2016"]
[]
["Il Decreto Commissariale n. 103 del 21/09/2016, avente ad oggetto \"Sisma Italia Centrale del 24/08/2016. Misure in materia di assistenza"]
["farmaceutica a favore della popolazione residente nei Comuni interessati dal terremoto - Regione Abruzzo, Lazio e Marche\", ha disposto"]
["l'esenzione dalla compartecipazione alla spesa farmaceutica a tutti i cittadini residenti nei Comuni di Montereale (AQ), Capitignano (AQ), "]
["Campotosto (AQ), Valle Castellana (TE), Rocca Santa Maria (TE) fino al 28/02/2017. Ha disposto, inoltre, che \"le farmacie convenzionate "]
["pubbliche e private che operano sul territorio della Regione Abruzzo possano spedire ricette SSN (sia cartacee che dematerializzate) "]
["provenienti dalle predette Regioni Lazio e Marche che contengono il codice di esenzione T016, esentando totalmente i relativi assistiti dalla "]
["compartecipazione alla spesa farmaceutica…\" ed al punto 8 del dispositivo ha precisato che \"gli oneri derivanti da tali prescrizioni saranno"]
["riconosciuti dalla predette Regioni nell'ambito della compensazione interregionale della mobilità sanitaria\". "]
["Tale decreto è stato integrato e prorogato, a seguito di ulteriori eventi sismici, con la D.G.R. n. 96 del 28/02/2017."]
["Di seguito si espongono i minori ricavi relativi all'esercizio 2017 per esenzione ticket  di cui al DCA n. 103 del 21/09/2016, integrato"]
[" e prorogato con DGR n. 96 del 28/02/2017, come elaborati dalla ditta Recordata Srl e comunicati dal servizio Farmaceutica Convenzionata "]
["con nota prot.551 del 15/02/18:"]
[]
[]
["Periodo","Azienda di residenza assistito","Provincia Assistito","Spesa Lorda","Spesa Netta","Ticket non Riscosso","Spesa Netta Teorica"]
["201701","201","ASCOLI PICENO (AP)",21.45,20.010000000000002,2,18.010000000000002]
["201701","201","MACERATA (MC)",153.04,147.12,17.809999999999999,129.31]
["201701","204",null,157.62,147.94999999999999,33.340000000000003,114.61]
["201702","201","ASCOLI PICENO (AP)",139.35,129.41,27.84,101.57]
["201702","201","MACERATA (MC)",174.77,168.41,23.01,145.4]
["201702","204",null,139.24,130.5,23.81,106.69]
["201703","201",null,35.58,33.44,6,27.44]
["201703","201","ASCOLI PICENO (AP)",43.45,41.18,5.48,35.700000000000003]
["201703","201","MACERATA (MC)",75.55,72.239999999999995,22.52,49.72]
["201703","202","PERUGIA (PG)",52.7,49.47,16.86,32.61]
["201703","204",null,44.27,41.84,12.46,29.38]
["201704","201",null,23.08,22.6,4.5,18.100000000000001]
["201704","201","MACERATA (MC)",81.180000000000007,78.27,14.3,63.97]
["201704","204",null,112.4,106.17,30.83,75.34]
["201705","204",null,829.91,763.97,130.01,633.96]
["201706","204",null,198.23,184.31,37.630000000000003,146.68]
["201707","204",null,8.36,7.84,1,6.84]
["201709","204",null,44.98,41.98,4,37.979999999999997]
[null,null,"Totali",{"$f":"SUM(D30:D47)","v":2335.1600000000003},{"$f":"SUM(E30:E47)","v":2186.7100000000005},{"$f":"SUM(F30:F47)","v":413.40000000000003},{"$f":"SUM(G30:G47)","v":1773.3100000000002}]
[null,null,"SubTotali",{"$f":"SUBTOTAL(9,D30:D47)","v":2335.1600000000003},{"$f":"SUBTOTAL(9,E30:E47)","v":2186.7100000000005},{"$f":"SUBTOTAL(9,F30:F47)","v":413.40000000000003},{"$f":"SUBTOTAL(9,G30:G47)","v":1773.3100000000002}]

{"sheet":"AS01-AS02","index":17,"n_rows":42,"n_cols":10,"rows_kept":42,"cut":false,"hidden":false,"merged":[[25,1,25,9],[28,1,28,4],[0,0,0,3],[2,0,2,1],[2,2,2,3],[2,4,2,9],[3,0,3,1],[3,4,3,9],[8,0,8,9],[6,0,6,9],[5,0,5,9],[9,0,9,9],[10,0,10,9],[16,1,16,2],[16,3,16,4],[17,1,17,2],[19,0,19,9],[7,0,7,9],[11,0,11,9],[12,0,12,9],[14,0,14,9],[17,3,17,4],[16,5,16,8],[17,5,17,8]]}
["Altre informazioni relative a acquisti di servizi"]
[]
["Informazione",null,"Caso presente in azienda?",null,"Se sì, illustrare"]
["AS01. Sono state rilevate significative variazioni rispetto all'esercizio precedente? ",null,null,"SI","Si veda commento sottostante."]
[]
["Complessivamente, il costo totale per l'acquisto di servizi sanitari ha subito un lieve incremento di €/000 1.584, dovuto essenzialmente alle variazioni di seguito specificate."]
["Il costo per acquisti di servizi sanitari per assistenza specialistica ambulatoriale è aumentato rispetto al 2016 di €/000 1.814, sostanzialmente per effetto della mobilità passiva infraregionale (+ €/000 473) ed extraregionale (+ €/000 1.411) da pubblico; "]
["Il costo per acquisti di servizi sanitari - medicina di base si è ridotto rispetto al 2016 di €/000 491. Tale variazione è ascrivibile principalmente alla riduzione del numero di accessi ADI (Assistenza Domiciliare Integrata) e ADP (Assistenza Domiciliare Programmata)."]
["Il costo per acquisti di prestazioni di psichiatria residenziale e semiresidenziale è diminuito di circa €/000 369. In particolare si è ridotto il costo per l'acquisto di prestazioni psichiatriche da strutture psicoriabilitative ubicate presso altre Regioni. "]
["Il costo per acquisti di prestazioni di trasporto sanitario è aumentato di circa €/000 1.082. Esso è essenzialmente riconducibile al costo del servizio di elisoccorso, affidato a livello regionale nel 2017 alla ditta BABCOCK MISSION CRITICAL SERV. ITALIA SPA. Nello specifico, il contratto prevede che la ASL di Pescara sostenga i costi anche per conto delle altre AASSLL, costi che sono classificati alla voce CE BA1130. A fronte di tali costi, la ASL di Pescara riceve dalla Regione specifiche assegnazioni per l'elisoccorso, che vengono contabilizzate come Contributi in c/esercizio per funzioni regionali. "]
["Il costo per acquisto di prestazioni socio-sanitarie a rilevanza sanitaria è diminuito di circa €/000 482 Tale variazione ha riguardato in particolare gli acquisti infraregionali da privato di prestazioni di assistenza domiciliare, gli acquisti da pubblico extraregione per assistenza geriatrica e gli acquisti da privato intraregionale per assistenza a tossicodipendenti ed alcolisti. "]
["I rimborsi, assegni e contributi sanitari sono diminuiti di circa €/000 407, a causa della riduzione dei contributi erogati a favore delle associazioni di volontariato (- €/000 147) e dei minori contributi v/ASL della Regione (in particolare, nel 2016 era stato erogato dalla Regione un contributo per la Tutela della salute mentale della donna, che la ASL di Pescara, in qualità di coordinatrice del progetto, aveva a sua volta assegnato alle altre AASSLL della Regione, rilevando un costo di €/000 186. Tale contributo non è presente nell'esercizio 2017)."]
["Il costo per Consulenze, collaborazioni, interninale ed altre prestazioni di lavoro sanitarie e sociosanitarie è aumentato di €/000 520. Tale variazione è imputabile essenzialmente ai maggiori costi sostenuti dall'azienda per lavoro interinale relativo all'area sanitaria, solo in parte compensati dalla riduzione della spesa per consulenze sanitarie da privato ex art. 55, comma 2, CCNL 8 giugno 2000 (quest'ultima voce di costo è dettagliata alla Tabella 60-bis). "]
[]
["Si rappresenta di seguito la suddivisione del costo medici SUMAI tra le varie tipologie specialistiche:"]
[]
["Voce CE "," Veterinari ",null," Psicologi ",null," Medici Ambulatoriali Interni ",null,null,null," TOTALE COSTO MEDICI SUMAI "]
[" BA0570 ",262838.03000000003,null,136548.89000000001,null,4499764.13,null,null,null,{"$f":"SUM(B18:G18)","v":4899151.05}]
[]
["Si precisa che nel costo della Specialistica ambulatoriale è compresa anche la spesa sostenuta per la Penitenziaria ed il Sert, in quanto queste ultime prestazioni vengono rese dagli stessi medici specialisti che contemporaneamente lavorano presso i Distretti."]
[]
["AS02 - Costi per prestazioni sanitarie da privato"]
[]
[]
["AS02 - Costi per prestazioni sanitarie da privato"]
["AS02 - SI","Con riferimento ai costi per acquisto da privati accreditati di prestazioni sanitarie si evidenzia per l’anno 2017 un volume complessivo del fatturato prodotto leggermente superiore ai tetti di spesa assegnati. Le prestazioni in Riabilitazione ex art. 26, R.S.A.,  Ambulatoriali Branche a Visita e Termali  presentano un fatturato complessivo entro i tetti di spesa annuale assegnati; per le prestazioni in R.A.  si è già provveduto al saldo finale di liquidazione con il pieno rispetto del Budget assegnato; le prestazioni di Ricoveri ospedalieri, Psico- riabilitazione e Ambulatoriali presentano un surplus di fatturato rispetto al budget assegnato che dovrà essere riassorbito a seguito dell'emissione di apposite note di credito da parte delle strutture interessate. "]
[]
[]
[null,"DETTAGLIO SCOSTAMENTI FATTURATO/BUDGET PER SPECIALITA'"]
[]
[null,"Tipologia","Fatturato","Budget","Scostamento"]
[]
[null,"RICOVERI",73817692,73127326,{"$f":"C33-D33","v":690366}]
[null,"RES. PROT.",8901463,8578336,{"$f":"C34-D34","v":323127}]
[null,"R.S.A.",4620329,4763464,-143135]
[null,"R.A.",772776,772776,0]
[null,"TERMALI",2638644,3286169,-647525]
[null,"RIABILITAZIONE",14460769,14535122,-74353]
[null,"AMB. C.D.C.",6970009,6806648,163361]
[null,"AMB. PRIV.",3520897,3508650,12247]
[null,"BRAN. A VISIT.",30679,45260,-14581]
[null,"TOTALE GENERALE",{"$f":"SUM(C33:C41)","v":115733258},115423751,{"$f":"SUM(E33:E41)","v":309507}]

{"sheet":"Tab 60-bis","index":18,"n_rows":47,"n_cols":9,"rows_kept":47,"cut":false,"hidden":false,"merged":[[26,3,28,3],[26,4,28,4],[5,4,7,4],[5,5,7,5],[5,6,7,6],[5,7,7,7],[0,0,0,8],[5,8,7,8],[26,5,28,5],[26,6,28,6],[26,7,28,7],[26,8,28,8],[4,0,4,8],[5,0,7,0],[5,1,7,1],[5,2,7,2],[5,3,7,3],[26,0,28,0],[26,1,28,1],[26,2,28,2]]}
["Tabella 60-bis - Consulenze sanitarie da privato - articolo 55, comma2, CCNL 8 giugno 2000"]
[]
["Si riporta di seguito il dettaglio dei costi per Consulenze sanitarie da privato - articolo 55, comma2, CCNL 8 giugno 2000, contabilizzate nella voce di conto 0702011503."]
[]
["Dettaglio composizione voce BA1390 \nConsulenze Sanitarie da Privato \nCONSUNTIVO 2017"]
["Medici "," Sede di appartenenza ","Linee di attività ","Motivazione ","Sede di Erogazione della prestazione ","Importo ","Irap ","Totale ","Note "]
[]
[]
["Personale Medico","UOC Centro Trasfusionale","Attività Ambulatoriale","Raccolta Sangue","PO Pescara - PO Penne - PO Popoli",153032.24999999994,13007.669999999996,166039.91999999993]
["Personale Medico","UOC Nefrologia e Dialisi","Trattamenti Dialitici","3° Turno di Dialisi","PO Pescara",94740,8052.9100000000008,102792.91]
["Personale Medico","UOC Anestesia e Rianimazione","Sedute Operatorie","Riduzione Liste d'Attesa","PO Pescara - PO Penne - PO Popoli",62640,5324.409999999998,67964.41]
["Personale Medico","UOC Radioterapia","Trattamenti Radioterapici","Riduzione Liste d'Attesa","PO Pescara - PO Penne - PO Popoli",23580,2004.3100000000002,25584.31]
["Personale Medico","UOC Diagnostica per Immagini","Attività Ambulatoriale","Riduzione Liste d'Attesa","PO Pescara - PO Penne - PO Popoli",0,0,0]
["Personale Medico","UOC Geriatria","Attività Domiciliare","Deospedalizzazione","PO Pescara",6240,530.41,6770.41]
["Personale Medico","UOC Ematologia","Attività Domiciliare","Deospedalizzazione","PO Pescara",157903.00000000006,13421.749999999993,171324.75000000006]
["Personale Medico","UOS Assistenza Intermedia","Attività Domiciliare","Deospedalizzazione","PO Pescara",34953.999999999993,2971.0999999999981,37925.099999999991]
["Personale Medico","UO varie","Turni Guardia Notturna","Carenza Personale","PO Pescara - PO Penne - PO Popoli",200640,17054.399999999965,217694.39999999997]
["Personale Medico","UOC Servizio Territoriale 118","Turni Guardia Notturna","Carenza Personale","Area Territoriale Asl Pescara",151680.00000000003,12892.770000000011,164572.77000000005]
["Personale Medico","UO varie","Attività Ambulatoriale","Riduzione Liste d'Attesa","PO Pescara - PO Penne - PO Popoli",25942.090000000004,2205.0200000000004,28147.110000000004]
["Personale Medico","UOC Pronto Soccorso","Turni Guardia Notturna","Carenza Personale","PO Pescara - PO Penne - PO Popoli",1920,163.19999999999999,2083.1999999999998]
["Personale Medico","UOC Laboratorio Analisi","Attività Ambulatoriale","Convenzione Forze Ordine","PO Pescara",28988.140000000018,2463.9999999999995,31452.140000000018]
["Personale Medico","UO varie Area Chirurgica","Sedute Operatorie","Riduzione Liste d'Attesa","PO Pescara - PO Penne - PO Popoli",147291.37,12496.270000000035,159787.64000000004]
["Personale Medico","UO varie","Turni Aggiuntivi Eventi Sportivi","Convenzione Ente Comune","PO Pescara",32146,2732.41,34878.410000000003]
["Personale Medico","UO varie","Convenzioni Varie","Convenzione Enti Diversi","PO Pescara",14158.35,1203.48,15361.83]
["Totale (A)  ",null,null,null,null,{"$f":"SUM(F9:F24)","v":1135855.2000000002},{"$f":"SUM(G9:G24)","v":96524.11},1232379.31]
[]
["Altre  Qualifiche  Professionali \n   (Specificare) "," Sede di appartenenza ","Linee di attività ","Motivazione ","Sede di Erogazione della prestazione ","Importo ","Irap ","Totale ","Note "]
[]
[]
["Equipe di Supporto","UOC Centro Trasfusionale","Attività Ambulatoriale","Raccolta Sangue","PO Pescara - PO Penne - PO Popoli",235482.63000000009,16162.370000000008,251645.00000000009]
["Equipe di Supporto","UOC Nefrologia e Dialisi","Trattamenti Dialitici","3° Turno di Dialisi","PO Pescara",309865.97000000026,21275.15,331141.12000000029]
["Equipe di Supporto","UOC Anestesia e Rianimazione","Sedute Operatorie","Riduzione Liste d'Attesa","PO Pescara - PO Penne - PO Popoli",166889.10000000003,11458.849999999995,178347.95000000004]
["Equipe di Supporto","UOC Radioterapia","Trattamenti Radioterapici","Riduzione Liste d'Attesa","PO Pescara - PO Penne - PO Popoli",55303.43,3797.2300000000023,59100.66]
["Equipe di Supporto","UOC Diagnostica per Immagini","Attività Ambulatoriale","Riduzione Liste d'Attesa","PO Pescara - PO Penne - PO Popoli",0,0,0]
["Equipe di Supporto","UOC Geriatria","Attività Domiciliare","Deospedalizzazione","PO Pescara",0,0,0]
["Equipe di Supporto","UOC Ematologia","Attività Domiciliare","Deospedalizzazione","PO Pescara",81359.030000000072,5586.5199999999977,86945.550000000076]
["Equipe di Supporto","UOS Assistenza Intermedia","Attività Domiciliare","Deospedalizzazione","PO Pescara",26382.959999999988,1811.4900000000002,28194.44999999999]
["Equipe di Supporto","UOC Centro Trasfusionale","Attività Ambulatoriale","Raccolta Sangue","PO Pescara - PO Penne - PO Popoli",38764.94999999999,3294.9799999999996,42059.929999999993]
["Equipe di Supporto","UOC Radioterapia","Trattamenti Radioterapici","Riduzione Liste d'Attesa","PO Pescara - PO Penne - PO Popoli",2280,193.8,2473.8000000000002]
["Equipe di Supporto","UO varie","Attività Ambulatoriale","Riduzione Liste d'Attesa","PO Pescara - PO Penne - PO Popoli",21695.240000000005,1489.4400000000007,23184.680000000008]
["Equipe di Supporto","UOC Laboratorio Analisi","Attività Ambulatoriale","Convenzione Forze Ordine","PO Pescara",107741.50000000003,7674.2600000000011,115415.76000000002]
["Equipe di Supporto","UO varie Area Chirurgica","Sedute Operatorie","Riduzione Liste d'Attesa","PO Pescara - PO Penne - PO Popoli",146060.47000000015,10425.790000000023,156486.26000000018]
["Equipe di Supporto","UO varie","Turni Aggiuntivi Eventi Sportivi","Convenzione Ente Comune","PO Pescara",37497.969999999972,2574.61,40072.579999999973]
["Equipe di Supporto","UO varie","Convenzioni Varie","Convenzione Enti Diversi","PO Pescara",7136.7299999999987,555.11,7691.8399999999983]
[]
["Totale  (B)",null,null,null,null,{"$f":"SUM(F30:F45)","v":1236459.9800000004},{"$f":"SUM(G30:G45)","v":86299.600000000035},1322759.580000001]
["TOTALE ( A+B)",null,null,null,null,{"$f":"+F46+F25","v":2372315.1800000006},{"$f":"+G46+G25","v":182823.71000000002},2555138.8900000011]

{"sheet":"Tab 61","index":19,"n_rows":63,"n_cols":13,"rows_kept":63,"cut":false,"hidden":false,"merged":[[61,10,62,10],[61,11,62,11],[61,0,62,0],[61,1,62,1],[61,2,62,2],[61,3,62,3],[61,4,62,4],[61,7,62,7],[61,8,62,8],[61,9,62,9],[33,11,34,11],[59,0,60,0],[59,1,60,1],[59,2,60,2],[59,3,60,3],[59,4,60,4],[59,7,60,7],[59,8,60,8],[59,9,60,9],[59,10,60,10],[59,11,60,11],[35,11,36,11],[37,0,38,0],[37,1,38,1],[37,2,38,2],[37,3,38,3],[37,4,38,4],[37,7,38,7],[37,8,38,8],[37,9,38,9],[37,10,38,10],[37,11,38,11],[35,0,36,0],[35,1,36,1],[29,11,30,11],[31,0,32,0],[31,1,32,1],[31,2,32,2],[31,3,32,3],[31,4,32,4],[31,7,32,7],[31,8,32,8],[31,9,32,9],[31,10,32,10],[31,11,32,11],[29,0,30,0],[29,1,30,1],[29,2,30,2],[29,3,30,3],[29,10,30,10],[29,4,30,4],[29,7,30,7],[29,8,30,8],[29,9,30,9],[21,11,22,11],[27,0,28,0],[27,1,28,1],[27,2,28,2],[27,3,28,3],[27,4,28,4],[27,7,28,7],[27,8,28,8],[27,9,28,9],[27,10,28,10],[27,11,28,11],[25,11,26,11],[25,0,26,0],[25,1,26,1],[25,2,26,2],[25,3,26,3],[25,4,26,4],[25,7,26,7],[25,9,26,9],[25,10,26,10],[0,0,0,8],[1,0,2,0],[1,1,2,1],[1,2,2,2],[1,3,2,3],[1,4,2,4],[1,5,2,6],[1,7,2,7],[1,8,2,8],[1,9,2,9],[1,10,2,10],[1,11,2,11],[1,12,2,12],[3,0,4,0],[3,1,4,1],[3,2,4,2],[3,3,4,3],[3,4,4,4],[3,7,4,7],[3,8,4,8],[3,9,4,9],[3,10,4,10],[3,11,4,11],[15,10,16,10],[15,11,16,11],[5,11,6,11],[7,0,8,0],[7,1,8,1],[7,2,8,2],[7,3,8,3],[7,4,8,4],[7,7,8,7],[7,8,8,8],[7,9,8,9],[7,10,8,10],[7,11,8,11],[5,0,6,0],[5,1,6,1],[5,2,6,2],[5,3,6,3],[5,4,6,4],[5,7,6,7],[5,8,6,8],[5,9,6,9],[5,10,6,10],[9,11,10,11],[11,0,12,0],[11,1,12,1],[11,2,12,2],[11,3,12,3],[11,4,12,4],[11,7,12,7],[11,8,12,8],[11,9,12,9],[11,10,12,10],[11,11,12,11],[9,0,10,0],[9,1,10,1],[9,2,10,2],[9,3,10,3],[9,4,10,4],[9,7,10,7],[9,8,10,8],[9,9,10,9],[9,10,10,10],[19,10,20,10],[19,11,20,11],[17,9,18,9],[13,11,14,11],[13,0,14,0],[13,1,14,1],[13,2,14,2],[13,3,14,3],[13,4,14,4],[13,8,14,8],[13,9,14,9],[13,10,14,10],[15,4,16,4],[17,0,18,0],[17,1,18,1],[17,2,18,2],[17,3,18,3],[17,4,18,4],[17,7,18,7],[17,8,18,8],[15,0,16,0],[15,1,16,1],[15,2,16,2],[15,3,16,3],[17,10,18,10],[21,10,22,10],[33,10,34,10],[35,10,36,10],[39,11,40,11],[17,11,18,11],[23,0,24,0],[23,1,24,1],[23,2,24,2],[23,3,24,3],[23,4,24,4],[23,7,24,7],[23,8,24,8],[23,9,24,9],[23,10,24,10],[23,11,24,11],[21,0,22,0],[21,1,22,1],[21,2,22,2],[21,3,22,3],[19,0,20,0],[19,1,20,1],[19,2,20,2],[19,3,20,3],[41,11,42,11],[39,0,40,0],[39,1,40,1],[39,2,40,2],[39,3,40,3],[39,4,40,4],[39,7,40,7],[39,10,40,10],[33,0,34,0],[33,1,34,1],[33,2,34,2],[33,3,34,3],[41,0,42,0],[41,1,42,1],[41,2,42,2],[41,3,42,3],[41,4,42,4],[41,7,42,7],[41,8,42,8],[41,9,42,9],[41,10,42,10],[33,4,34,4],[33,7,34,7],[33,8,34,8],[43,11,44,11],[45,1,46,1],[45,2,46,2],[45,3,46,3],[45,4,46,4],[45,7,46,7],[45,8,46,8],[45,9,46,9],[45,10,46,10],[45,11,46,11],[43,1,44,1],[43,2,44,2],[43,3,44,3],[43,4,44,4],[43,7,44,7],[43,8,44,8],[43,9,44,9],[43,10,44,10],[47,11,48,11],[49,1,50,1],[49,2,50,2],[49,3,50,3],[49,4,50,4],[49,7,50,7],[49,8,50,8],[49,9,50,9],[49,10,50,10],[49,11,50,11],[47,1,48,1],[47,2,48,2],[47,3,48,3],[47,4,48,4],[47,7,48,7],[47,8,48,8],[47,9,48,9],[47,10,48,10],[53,4,54,4],[53,7,54,7],[53,8,54,8],[53,9,54,9],[53,10,54,10],[53,11,54,11],[51,1,52,1],[51,2,52,2],[51,3,52,3],[51,4,52,4],[51,7,52,7],[51,8,52,8],[51,9,52,9],[51,10,52,10],[51,11,52,11],[55,11,56,11],[57,0,58,0],[57,2,58,2],[57,3,58,3],[57,4,58,4],[57,7,58,7],[57,8,58,8],[57,9,58,9],[55,0,56,0],[55,1,56,1],[55,2,56,2],[55,3,56,3],[55,4,56,4],[55,7,56,7],[55,8,56,8],[55,9,56,9],[55,10,56,10],[53,0,54,0],[53,1,54,1],[53,2,54,2],[53,3,54,3],[45,0,46,0],[43,0,44,0],[47,0,48,0],[49,0,50,0],[51,0,52,0],[13,7,14,7],[15,7,16,7],[15,8,16,8],[15,9,16,9],[39,8,40,8],[39,9,40,9],[35,2,36,2],[35,3,36,3],[35,4,36,4],[35,7,36,7],[35,8,36,8],[35,9,36,9],[19,8,20,8],[19,9,20,9],[21,4,22,4],[21,7,22,7],[21,8,22,8],[21,9,22,9],[25,8,26,8],[33,9,34,9],[19,4,20,4],[19,7,20,7]]}
["Tab. 61 – Dettaglio acquisti di servizi sanitari da privato"]
["DETTAGLIO ACQUISTI DI SERVIZI SANITARI - DA PRIVATO","Codice Struttura da classificazione NSIS","Partita IVA (o Codice Fiscale)","Tipologia di prestazione","Anno di competenza","Importo fatturato",null,"Budget / Tetto annuale","Importo liquidato/ certificato","Importo Rilevato in Co.Ge.","Importo delle note di credito richieste","Importo delle note di credito ricevute","Importo pagato"]
[null,"Codice Struttura Sts11","Partita Iva",null,null,null,null,"Valore Considerato A Budget Nella Fase Di Liquidazione - Per L'Anno 2008 E Ante Indicare La Parte Residua, Ovvero Il Delta Rilevato Tra Importo Fatturato (Al Netto Di Eventuali Note Di Credito) Ed Il Budget Di Riferimento.",null,"Importo Rilevato In Coge","Importo Delle Note Di Credito Richieste","Importo Delle Note Di Credito Richieste"]
["C.D.C. VILLA SERENA",130024,1220790685,"Ricoveri",2017,"Regionale",33366177.370000001,37973805,{"$f":"M4+M5","v":35986707.829999998},{"$f":"G4+G5","v":38663454.289999999},685149.29,0,{"$f":"31649844.58+224386.37","v":31874230.949999999}]
[null,null,null,null,null,"Extra-regionale",5297276.92,null,null,null,null,null,4112476.88]
["C.D.C. SYNERGO",130022,62520689,"Ricoveri",2017,"Regionale",28533810.600000001,35153521,{"$f":"M6+M7","v":29717196.349999998},{"$f":"G6+G7","v":35154237.75},0,0,24206697.059999999]
[null,null,null,null,null,"Extra-regionale",6620427.1500000004,null,null,null,null,null,5510499.29]
["C.D.C. VILLA SERENA","001302 - 001312",1220790685,"Residenze protette",2017,"Regionale",8901463.0700000003,8578336.3399999999,{"$f":"M8+M9","v":8476170.8300000001},{"$f":"G8+G9","v":8901463.0700000003},425292.24,0,8476170.8300000001]
[null,null,null,null,null,"Extra-regionale",0,null,null,null,null,null,0]
["C.D.C. VILLA SERENA","001313",1220790685,"R.S.A.",2017,"Regionale",2190943.48,1813797.24,{"$f":"M10+M11","v":899341.12},{"$f":"G10+G11","v":2190943.48},0,0,899341.12]
[null,null,null,null,null,"Extra-regionale",0,null,null,null,null,null,0]
["C.I.S.E.",130119,1741480683,"R.S.A.",2017,"Regionale",568133.43000000005,737495.64,{"$f":"M12+M13","v":568133.43000000005},{"$f":"G12+G13","v":568133.43000000005},518.5,518.5,568133.43000000005]
[null,null,null,null,null,"Extra-regionale",0,null,null,null,null,null,0]
["CASA DI CURA MEDAGLIA D'ORO DE CESARIS S.P.A.","006246","00117030684","R.S.A.",2017,"Regionale",1861252.15,2212171.38,{"$f":"M14+M15","v":1719592.41},{"$f":"G14+G15","v":1861252.15},0,0,1719592.41]
[null,null,null,null,null,"Extra-regionale",0,null,null,null,0,0,0]
["IL GIARDINO",130108,1562130680,"R.A.",2017,"Regionale",772775.72,772775.72,{"$f":"M16+M17","v":772775.72},{"$f":"G16+G17","v":772775.72},18793.009999999998,18793.009999999998,772775.72]
[null,null,null,null,null,"Extra-regionale",0]
["TERME DI POPOLI","018101",1125990687,"Termali",2017,"Regionale",638219.28,769864.53,{"$f":"M18+M19","v":678072.69000000006},{"$f":"G18+G19","v":678072.69000000006},1098.0999999999999,1098.0999999999999,638219.28]
[null,null,null,null,null,"Extra-regionale",39853.410000000003,null,null,null,null,null,39853.410000000003]
["TERME DI CARAMANICO","018001",1113020687,"Termali",2017,"Regionale",1699056.09,2516304.71,{"$f":"M20+M21","v":1960571.05},{"$f":"G20+G21","v":1960571.05},6437.98,6437.98,1699056.09]
[null,null,null,null,null,"Extra-regionale",261514.96,null,null,null,null,null,261514.96]
["IST. DON ORIONE",130063,1105681009,"Riabilitazione",2017,"Regionale",3876290.39,3919657.15,{"$f":"M22+M23","v":3876290.39},{"$f":"G22+G23","v":3876290.39},4601.0600000000004,4601.0600000000004,3876290.39]
[null,null,null,null,null,"Extra-regionale"]
["FOND. PAPA PAOLO VI","130060/64/65/79/80/81/82",1127170684,"Riabilitazione",2017,"Regionale",8693181.4000000004,8723716.8800000008,{"$f":"M24+M25","v":8480603.6099999994},{"$f":"G24+G25","v":8693181.4000000004},0,0,8480603.6099999994]
[null,null,null,null,null,"Extra-regionale"]
["SAN STEF AR SRL","130061-130062",2014620682,"Riabilitazione",2017,"Regionale",1703506.43,1703625,{"$f":"M26+M27","v":1644216.75},{"$f":"G26+G27","v":1703506.43},0,0,1644216.75]
[null,null,null,null,null,"Extra-regionale"]
["CENTRO DI SOLIDARIETA' ASS.GRUP.S. ONLUS",130777,91002370681,"Riabilitazione",2017,"Regionale",187791.24,188123.32,{"$f":"M28+M29","v":187791.24},{"$f":"G28+G29","v":187791.24},1328.32,1328.32,187791.24]
[null,null,null,null,null,"Extra-regionale"]
["C.D.C. VILLA SERENA","001301-001314-001315",1220790685,"Ambulatoriale Case di Cura",2017,"Regionale",3761706.37,3706204,{"$f":"M30+M31","v":3011834.68},{"$f":"G30+G31","v":3869565.49},0,0,2928332.18]
[null,null,null,null,null,"Extra-regionale",107859.12,null,null,null,null,null,83502.5]
["C.D.C. SYNERGO","000501-000502-000503",62520689,"Ambulatoriale Case di Cura",2017,"Regionale",3026363.23,3100444,{"$f":"M32+M33","v":2343992.7600000002},{"$f":"G32+G33","v":3100444},0,0,2290042.52]
[null,null,null,null,null,"Extra-regionale",74080.77,null,null,null,null,null,53950.239999999998]
["ISTITUTO DON ORIONE ","003101",1105681009,"Ambulatoriale Altri Privati",2017,"Regionale",139044.78,141137,{"$f":"M34+M35","v":124693.19},{"$f":"G34+G35","v":140924.38},0,0,123280.97]
[null,null,null,null,null,"Extra-regionale",1879.6,null,null,null,null,null,1412.22]
["CENTRO FISIOCHINESITERAPICO DELLA DOT.MASCI GIOVANNA & C. S.A.S.","003801",1103910681,"Ambulatoriale Altri Privati",2017,"Regionale",276800.71999999997,274626,{"$f":"M36+M37","v":253311.64},{"$f":"G36+G37","v":278596.09999999998},0,0,251818.82]
[null,null,null,null,null,"Extra-regionale",1795.38,null,null,null,null,null,1492.82]
["VUZA MARIA & C S.A.S.","003601",1107760686,"Ambulatoriale Altri Privati",2017,"Regionale",215830.7,218182,{"$f":"M38+M39","v":180794.91},{"$f":"G38+G39","v":218158},4805.07,4805.07,178898.7]
[null,null,null,null,null,"Extra-regionale",2327.3000000000002,null,null,null,null,null,1896.21]
["FISIOTER S.A.S.","003401",944790682,"Ambulatoriale Altri Privati",2017,"Regionale",396019.48,403623,355153.26,{"$f":"G40+G41","v":403700.47999999998},0,0,348582.45]
[null,null,null,null,null,"Extra-regionale",7681,null,null,null,null,null,6570.81]
["CLINITEST S.R.L.","010501",200370682,"Ambulatoriale Altri Privati",2017,"Regionale",51701.42,51611,0,{"$f":"G42+G43","v":51961.74},0,0,0]
[null,null,null,null,null,"Extra-regionale",260.32,null,null,null,null,null,0]
["CO.PAN SAS ISTITUTO DI FISIOKINESITERAPIA","009151",908760689,"Ambulatoriale Altri Privati",2017,"Regionale",134225.65,135987,123678.20000000001,{"$f":"G44+G45","v":135963},24223.45,24223.45,122218.07]
[null,null,null,null,null,"Extra-regionale",1737.35,null,null,null,null,null,1460.13]
["4R SNC STUDIO DI RADIOLOGIA MEDICA","003701",307580688,"Ambulatoriale Altri Privati",2017,"Regionale",73778.320000000007,75011,58187.9,{"$f":"G46+G47","v":73953.640000000014},0,0,58046.080000000002]
[null,null,null,null,null,"Extra-regionale",175.32,null,null,null,null,null,141.82]
["COLAROSSI ROBERTO & C. SAS","004201",1339250688,"Ambulatoriale Altri Privati",2017,"Regionale",109555.15,109575,90955.34,{"$f":"G48+G49","v":109555.15},0,0,90955.34]
[null,null,null,null,null,"Extra-regionale",0,null,null,null,null,null,0]
["RADIOLOGIA MEDICA REGINA MARGHERITA","010801",322520685,"Ambulatoriale Altri Privati",2017,"Regionale",111116.05,112961,95983.98,{"$f":"G50+G51","v":111463.6},198.57,198.57,95750.7]
[null,null,null,null,null,"Extra-regionale",347.55,null,null,null,null,null,233.28]
["BLEU  SRL RADIOLOGIA","004501",997880687,"Ambulatoriale Altri Privati",2017,"Regionale",363532.6,365863,284901.84999999998,{"$f":"G52+G53","v":366854.72},0,0,282312.24]
[null,null,null,null,null,"Extra-regionale",3322.12,null,null,null,null,null,2589.61]
["DOTT. ROLANDO COLLEVECCHIO","009601",1093440681,"Ambulatoriale Altri Privati",2017,"Regionale",25436.35,24066,0,{"$f":"G54+G55","v":25436.35},0,0,0]
[null,null,null,null,null,"Extra-regionale",0,null,null,null,null,null,0]
["CONSORZIO GRUPPO ATQ",null,1959880681,"Ambulatoriale Altri Privati",2017,"Regionale",1012094.58,1035060,797923.45,{"$f":"G56+G57","v":1021387.8099999999},0,0,790679.76]
[null,null,null,null,null,"Extra-regionale",9293.23,null,null,null,null,null,7243.69]
["LIFECARE S.R.L.",null,3435870286,"Ambulatoriale Altri Privati",2017,"Regionale",575281.22,560947,423343.4,{"$f":"G58+G59","v":582941.86},0,0,417763.38]
[null,null,null,null,null,"Extra-regionale",7660.64,null,null,null,0,0,5580.02]
["DOTT.SSA ORLANDI","014401",1212420689,"Branche a visita",2017,"Regionale",12810.18,22554,10683.17,{"$f":"G60+G61","v":12810.18},0,0,10683.17]
[null,null,null,null,null,"Extra-regionale",0,null,null,null,null,null,0]
["DOTT. MINICUCCI","006001",1887300687,"Branche a visita",2017,"Regionale",17868.61,22706,14866.46,{"$f":"G62+G63","v":17868.61},0,0,14866.46]
[null,null,null,null,null,"Extra-regionale",0,null,null,null,null,null,0]

{"sheet":"Tab 61bis","index":20,"n_rows":41,"n_cols":3,"rows_kept":41,"cut":false,"hidden":false,"merged":[[33,0,33,1],[37,0,37,1],[39,0,39,1],[2,0,2,2],[5,0,5,1],[7,0,7,1],[15,0,15,1],[17,0,17,1],[31,0,31,1]]}
[]
[null,null,"Tabella 61-bis"]
["Dettaglio acquisti da privato di prestazioni non rientranti nei contratti negoziali \n(Acquisti Diretti)"]
["Struttura privata erogante","Tipologia assistenza/prestazione","Totale prestazione"]
["VILLA SERENA DR.L.PETRUZZI S.R.L.","Specialistica ambulatoriale",2664.58]
["CONTO 0702010313 - Servizi sanitari da case di cura private - per cittadini residenti acquistate fuori contratti negoziali in strutture entro regione (assistenza specialistica ambulatoriale)",null,{"$f":"SUM(C5)","v":2664.58}]
["LIFECARE S.R.L.","Specialistica ambulatoriale",2298.15]
["CONTO 0702010321 - Servizi sanitari da altri soggetti privati - per cittadini residenti acquistate fuori contratti negoziali in strutture entro regione (assistenza specialistica ambulatoriale)",null,{"$f":"SUM(C7)","v":2298.15}]
["LEGA DEL FILO D'ORO","Riabilitazione ex art. 26",8495.26]
["OPERA PIA ESSA G.MANCINELLIMONTELPARO","Riabilitazione ex art. 26",96623.44]
["CASA DIVINA PROVVIDENZA","Riabilitazione ex art. 26",233443.16]
["KOS CARE S.R.L.(EX IST. RIAB. SANTO STEFANO)","Riabilitazione ex art. 26",87146.59]
["CENTRO RIABILITAZIONE MOTORIA PADRE PIO ","Riabilitazione ex art. 26",26989.9]
["COOP. LUCE SUL MARE SOC. COOP.SOCIALECENTRO DI RIABILITAZIONE PRIVATO","Riabilitazione ex art. 26",89832]
["IST. DI RIAB. C.A.R.S.I.C.","Riabilitazione ex art. 26",48848]
["CONTO 0702010408 - Da privato accreditato per cittadini residenti acquistate in strutture fuori Regione (Riabilitazione ex art. 26)",null,{"$f":"SUM(C9:C15)","v":591378.35}]
["CONSORZIO COOPERATIVE SOCIALI S.G.S.","Assistenza psichiatrica",770417.52]
["CONTO 0702010807 - Da privato accreditato per cittadini residenti acquistate fuori contratti negoziali in strutture entro Regione (Strutture Psicoriabilitative) (intraregionale)",null,{"$f":"SUM(C17)","v":770417.52}]
["GNOSIS S.C.R.L.","Assistenza psichiatrica",109019.27]
["COOPERATIVA ARL RAYMOND GLEDHILL ONLUS","Assistenza psichiatrica",55128.15]
["SOGEPI S.R.L.","Assistenza psichiatrica",94170]
["LA GOCCIA SOC.COOP.SOCIALE","Assistenza psichiatrica",257065.13]
["INVESTIMENTI CERESIO SRL","Assistenza psichiatrica",150102]
["SERENITY HOUSE EAGLES SRLCASA DI RIPOSO-CASA PROTETTA-","Assistenza psichiatrica",84554.8]
["ATENA SRL","Assistenza psichiatrica",566884.4]
["ITALIAN HOSPITAL GROUP","Assistenza psichiatrica",46698]
["RESIDENZE ANNI AZZURRI S.R.L.","Assistenza psichiatrica",12069.26]
["ABITARE IL TEMPO SRL","Assistenza psichiatrica",87062.5]
["SERENI ORIZZONTI SPA","Assistenza psichiatrica",395958.7]
["GES.CA.S. VILLA ARMONIA NUOVA SRL","Assistenza psichiatrica",6042.6]
["COOP.STELLA SOC.COOPERATIVA SOC.","Assistenza psichiatrica",7644]
["CONTO 0702010809 - Da privato accreditato per cittadini residenti acquistate in strutture fuori Regione (Strutture Psicoriabilitative) (extraregionale)",null,{"$f":"SUM(C19:C31)","v":1872398.81}]
["DIAVERUM ITALIA SRL","Assistenza geriatrica",891013.35]
["CONTO 0702011225 - Altre prestazioni socio sanitarie a rilevanza sanitaria da privato (intraregionale e extraregionale)",null,{"$f":"SUM(C33)","v":891013.35}]
["A.S.P. PAOLO RICCI AZ.PUBBLICA DI SERVIZ","Assistenza geriatrica",20509.2]
["AKKANTO SOCIETA' COOPERATIVA SOC.ONLUS","Assistenza geriatrica",35335.870000000003]
["A.N.F.F.A.S. ONLUS CONERO","Assistenza geriatrica",19750.150000000001]
["CONTO 0702011226 - Da privato accreditato per assistenza geriatrica per cittadini residenti acquistate in strutture fuori Regione (Centri Residenziali)",null,{"$f":"SUM(C35:C37)","v":75595.22}]
["CONGREG.PICCOLE SUORE MISSIONARIE DELLACARITA' PICCOLO COTTOLENGO DI DON ORIONE","Assistenza geriatrica",35386.75]
["CONTO 0702011227 - Da privato accreditato per assistenza geriatrica per cittadini residenti acquistate in strutture fuori Regione (Residenze Sanitarie Assistite)",null,{"$f":"SUM(C39)","v":35386.75}]
["TOTALE GENERALE",null,{"$f":"C6+C16+C18+C32+C34+C38+C40","v":4238854.58}]

{"sheet":"AS03","index":21,"n_rows":123,"n_cols":6,"rows_kept":123,"cut":false,"hidden":false,"merged":[[101,2,101,3],[102,2,102,3],[103,2,103,3],[104,2,104,3],[105,2,105,3],[92,2,92,3],[93,2,93,3],[94,2,94,3],[95,2,95,3],[96,2,96,3],[97,2,97,3],[98,2,98,3],[99,2,99,3],[100,2,100,3],[83,2,83,3],[84,2,84,3],[85,2,85,3],[86,2,86,3],[87,2,87,3],[88,2,88,3],[89,2,89,3],[90,2,90,3],[91,2,91,3],[0,0,0,6],[2,1,2,4],[4,2,4,3],[7,2,7,3],[8,2,8,3],[9,2,9,3],[42,2,42,3],[43,2,43,3],[44,2,44,3],[22,2,22,3],[27,2,27,3],[28,1,28,3],[38,2,38,3],[39,2,39,3],[40,2,40,3],[10,2,10,3],[11,2,11,3],[12,2,12,3],[13,2,13,3],[19,2,19,3],[16,2,16,3],[14,2,14,3],[15,2,15,3],[29,2,29,3],[111,2,111,3],[62,2,62,3],[63,2,63,3],[64,2,64,3],[106,2,106,3],[36,2,36,3],[37,2,37,3],[46,2,46,3],[47,2,47,3],[48,2,48,3],[49,2,49,3],[50,2,50,3],[52,2,52,3],[53,2,53,3],[54,2,54,3],[55,2,55,3],[41,2,41,3],[51,2,51,3],[45,2,45,3],[56,2,56,3],[57,2,57,3],[76,2,76,3],[77,2,77,3],[78,2,78,3],[18,2,18,3],[20,2,20,3],[21,2,21,3],[23,2,23,3],[110,2,110,3],[65,2,65,3],[69,2,69,3],[66,2,66,3],[67,2,67,3],[68,2,68,3],[58,2,58,3],[31,2,31,3],[32,2,32,3],[30,1,30,3],[33,2,33,3],[34,2,34,3],[35,2,35,3],[79,2,79,3],[80,2,80,3],[81,2,81,3],[82,2,82,3],[59,2,59,3],[60,2,60,3],[61,2,61,3],[5,2,5,3],[6,1,6,3],[6,5,6,6],[122,0,122,6],[73,2,73,3],[70,2,70,3],[71,2,71,3],[72,2,72,3],[74,2,74,3],[75,2,75,3],[112,1,112,3],[113,2,113,3],[114,2,114,3],[115,2,115,3],[116,2,116,3],[107,2,107,3],[108,2,108,3],[109,1,109,3],[117,1,117,3],[118,0,118,3],[17,1,17,3],[24,1,24,3],[25,2,25,3],[26,1,26,3]]}
["AS03 - Consulenze, Collaborazioni, Interinale e altre prestazioni di lavoro sanitarie e sociosanitarie"]
[]
["AS03 - SI","Nell'esercizio sono stati rilevati costi per consulenze, collaborazioni, interinale e altre prestazioni di lavoro sanitarie e sociosanitarie. Si veda dettaglio sottostante per tipologia di prestazione, soggetto fornitore e importo."]
[]
["Cod. Conto","Descrizione","Fornitore",null,"Importo"]
["0702011503","Consulenze sanitarie da privato - articolo 55, comma 2, CCNL 8 giugno 2000","PERSONALE  - VARIE QUALIFICHE",null,2372315.1800000002]
["0702011503","Consulenze sanitarie da privato - articolo 55, comma 2, CCNL 8 giugno 2000",null,null,{"$f":"SUM(E6)","v":2372315.1800000002},"IMPORTO DETTAGLIATO ALLA TABELLA 60-bis"]
["0702011505","Consulenze sanitarie e sociosanitarie da privato","RICCI PASQUALE",null,1780]
["0702011505","Consulenze sanitarie e sociosanitarie da privato","CECCOMANCINI LIANA","DE CINQUE GIUSEPPE",600]
["0702011505","Consulenze sanitarie e sociosanitarie da privato","MARANI TORO PATRIZIA","DALLE FESTE ATTILIO",1602.28]
["0702011505","Consulenze sanitarie e sociosanitarie da privato","STOCCO GIANLUCA",null,760.54]
["0702011505","Consulenze sanitarie e sociosanitarie da privato","FINOCCHIO ALESSIO",null,199.99]
["0702011505","Consulenze sanitarie e sociosanitarie da privato","BUCCELLA CLAUDIO",null,739.99]
["0702011505","Consulenze sanitarie e sociosanitarie da privato","DI MATTEO RAFFAELE",null,950]
["0702011505","Consulenze sanitarie e sociosanitarie da privato","ROMANELLI DANTE",null,348.77]
["0702011505","Consulenze sanitarie e sociosanitarie da privato","ANGELINI STEFANO",null,850]
["0702011505","Consulenze sanitarie e sociosanitarie da privato","INPS","MAZZOTTA ELENA",173.72]
["0702011505","Totale consulenze sanitarie e sociosanitarie da privato",null,null,{"$f":"SUM(E8:E17)","v":8005.29}]
["0702011509","Collaborazioni coordinate e continuative sanitarie","IZZICUPO GERMANO",null,370]
["0702011509","Collaborazioni coordinate e continuative sanitarie","MARCELLA ANTONIO","MARCELLA ANTONIO",1901.99]
["0702011509","Collaborazioni coordinate e continuative sanitarie","FARICELLI MARINO","FARICELLI MARINO",428.23]
["0702011509","Collaborazioni coordinate e continuative sanitarie","LIBERALE BARBARA","LIBERALE BARBARA",151.99]
["0702011509","Collaborazioni coordinate e continuative sanitarie","DE ACETIS LUIGI","DE ACETIS LUIGI",70]
["0702011509","Collaborazioni coordinate e continuative sanitarie","DOMENICONE ANTONIO","DOMENICONE ANTONIO",5490.91]
["0702011509","Totale Collaborazioni coordinate e continuative sanitarie",null,null,{"$f":"SUM(E19:E24)","v":8413.119999999999}]
["0702011510","Indennità a personale universitario - area sanitaria","Università G. d'Annunzio di Chieti",null,242210.34]
["0702011510","Totale Indennità a personale universitario - area sanitaria",null,null,{"$f":"SUM(E26)","v":242210.34}]
["0702011511","Lavoro interinale - area sanitaria","MANPOWER SRL",null,2608784.9]
["0702011511","Totale lavoro interinale - area sanitaria",null,null,{"$f":"SUM(E28)","v":2608784.9}]
["0702011515","Altre collaborazioni e prestazioni di lavoro - area sanitaria","Professionisti vari (giudizi medico-legali)",null,1378.08]
["0702011515","Totale Altre collaborazioni e prestazioni di lavoro - area sanitaria",null,null,{"$f":"SUM(E30)","v":1378.08}]
["0702011516","Personale tirocinante compresi oneri riflessi","MERCURIO ANTONIO",null,1800]
["0702011516","Personale tirocinante compresi oneri riflessi","MORETTA SILVIA",null,900]
["0702011516","Personale tirocinante compresi oneri riflessi","CECI LORENZO",null,900]
["0702011516","Personale tirocinante compresi oneri riflessi","PALUMBO CARLO",null,900]
["0702011516","Personale tirocinante compresi oneri riflessi","TORRIERI ANTONELLO",null,1800]
["0702011516","Personale tirocinante compresi oneri riflessi","INAIL PESCARA",null,691.39]
["0702011516",null,"Totale personale tirocinante compresi oneri riflessi",null,{"$f":"SUM(E32:E37)","v":6991.39}]
["0702011517","Borsisti compresi oneri riflessi","TARABORRELLI MERILDA",null,16059.93]
["0702011517","Borsisti compresi oneri riflessi","FANTASIA DONATELLA",null,22942.44]
["0702011517","Borsisti compresi oneri riflessi","SCIACCA ANTONINA",null,4004.42]
["0702011517","Borsisti compresi oneri riflessi","ESATTORE FRANCESCA",null,19118.09]
["0702011517","Borsisti compresi oneri riflessi","DI ZACOMO SILVIA",null,19103.560000000001]
["0702011517","Borsisti compresi oneri riflessi","MARANI TORO PATRIZIA",null,19342.63]
["0702011517","Borsisti compresi oneri riflessi","BRATTELLI ANTONELLO",null,12802.37]
["0702011517","Borsisti compresi oneri riflessi","SORGENTONE SIMONA",null,20489.82]
["0702011517","Borsisti compresi oneri riflessi","RANUCCI ELENA",null,23859.49]
["0702011517","Borsisti compresi oneri riflessi","RICCIARDI ILDA ROSARIA",null,11218.06]
["0702011517","Borsisti compresi oneri riflessi","TARICANI STEFANO",null,11218.14]
["0702011517","Borsisti compresi oneri riflessi","ZACCAGNINI ALEXIA",null,11217.1]
["0702011517","Borsisti compresi oneri riflessi","PERSICO ALESSIA",null,10642.44]
["0702011517","Borsisti compresi oneri riflessi","BURATTINI STEFANO",null,16519.14]
["0702011517","Borsisti compresi oneri riflessi","D'ALOISIO MARIANNA",null,17130.11]
["0702011517","Borsisti compresi oneri riflessi","DELL'ORLETTA ELEONORA",null,10783.67]
["0702011517","Borsisti compresi oneri riflessi","PASCALE SILVIA",null,18047.96]
["0702011517","Borsisti compresi oneri riflessi","VITULLO FELICE",null,29748.560000000001]
["0702011517","Borsisti compresi oneri riflessi","LUCIANI STEFANIA",null,11570.08]
["0702011517","Borsisti compresi oneri riflessi","SBARAGLIA VALENTINA",null,13746.01]
["0702011517","Borsisti compresi oneri riflessi","DE THOMASIS VALENTINA",null,17077.990000000002]
["0702011517","Borsisti compresi oneri riflessi","ANTONUCCI MARIANGELA",null,11454.18]
["0702011517","Borsisti compresi oneri riflessi","CONTI LUCIA",null,14001.67]
["0702011517","Borsisti compresi oneri riflessi","VENTURA  JESSICA",null,10188.549999999999]
["0702011517","Borsisti compresi oneri riflessi","SIGISMONDI SARA",null,14001.56]
["0702011517","Borsisti compresi oneri riflessi","CEGLIE LUIGI",null,14002.67]
["0702011517","Borsisti compresi oneri riflessi","ARGENTIERI ANGELA VALENTINA",null,5097.63]
["0702011517","Borsisti compresi oneri riflessi","PERILLI PATRIZIA",null,7351.68]
["0702011517","Borsisti compresi oneri riflessi","RICCIUTI GIUSEPPINA",null,26231.3]
["0702011517","Borsisti compresi oneri riflessi","CANTO CLAUDIA LUIGIA",null,10188.94]
["0702011517","Borsisti compresi oneri riflessi","FARINA VERDIANA",null,15855.77]
["0702011517","Borsisti compresi oneri riflessi","SCIARRA PIERPAOLA",null,16518.689999999999]
["0702011517","Borsisti compresi oneri riflessi","MIRRA NOEMI",null,15272.59]
["0702011517","Borsisti compresi oneri riflessi","D'ADDARIO DORA",null,24777.03]
["0702011517","Borsisti compresi oneri riflessi","DI FRANCESCANTONIO ROSSELLA",null,1031.83]
["0702011517","Borsisti compresi oneri riflessi","CANNARSA ROBERTA",null,14223.61]
["0702011517","Borsisti compresi oneri riflessi","COLAROSSI SABRINA",null,13442.13]
["0702011517","Borsisti compresi oneri riflessi","ESPOSITO ANNALISA",null,4033.35]
["0702011517","Borsisti compresi oneri riflessi","PERROTTA ELEONORA",null,13754.07]
["0702011517","Borsisti compresi oneri riflessi","PETACCIA VALENTINA",null,13745.76]
["0702011517","Borsisti compresi oneri riflessi","CRISCI ERIKA",null,2007.41]
["0702011517","Borsisti compresi oneri riflessi","VIOLA GIOVANNA",null,1396.21]
["0702011517","Borsisti compresi oneri riflessi","DIODATI FEDERICA",null,1146.05]
["0702011517","Borsisti compresi oneri riflessi","DONATO SIMONE",null,6346.12]
["0702011517","Borsisti compresi oneri riflessi","SPADANO RAFFAELE",null,16058.85]
["0702011517","Borsisti compresi oneri riflessi","CAPORALE MARTA",null,27529.85]
["0702011517","Borsisti compresi oneri riflessi","ZARA FEDERICA",null,13765.04]
["0702011517","Borsisti compresi oneri riflessi","D'ALESSANDRO MASSIMO",null,16518.240000000002]
["0702011517","Borsisti compresi oneri riflessi","DI GIOVANNI MICHELA",null,8612.7800000000007]
["0702011517","Borsisti compresi oneri riflessi","DI CARLO SIMONA",null,12981.74]
["0702011517","Borsisti compresi oneri riflessi","FLACCO MARIA ELENA",null,20188.55]
["0702011517","Borsisti compresi oneri riflessi","AMICANTONIO ALESSANDRA",null,12981.5]
["0702011517","Borsisti compresi oneri riflessi","DI NICOLA LORELLA",null,15859.59]
["0702011517","Borsisti compresi oneri riflessi","LAURITA FILOMENA",null,11450.39]
["0702011517","Borsisti compresi oneri riflessi","LO STERZO ROSA",null,9139.19]
["0702011517","Borsisti compresi oneri riflessi","PELINO LAURA",null,13765.75]
["0702011517","Borsisti compresi oneri riflessi","CUCCHIARELLI SILVIA",null,11471.44]
["0702011517","Borsisti compresi oneri riflessi","BROCCOLI LEONILDA",null,7630.24]
["0702011517","Borsisti compresi oneri riflessi","DI LISO ELISABETTA",null,14913]
["0702011517","Borsisti compresi oneri riflessi","RANALLI PAOLA",null,10936.41]
["0702011517","Borsisti compresi oneri riflessi","PISCIELLA FLORIANA",null,5735.92]
["0702011517","Borsisti compresi oneri riflessi","MASCIA MANLIO",null,8278.81]
["0702011517","Borsisti compresi oneri riflessi","MERLA VITALONE STEFANO",null,7966.15]
["0702011517","Borsisti compresi oneri riflessi","IANNELLI TIZIANA",null,6692.34]
["0702011517","Borsisti compresi oneri riflessi","CLEMENTE KATIA",null,6610.48]
["0702011517","Borsisti compresi oneri riflessi","RINCHI ALICE",null,5506.9]
["0702011517","Borsisti compresi oneri riflessi","SANTONE CELESTE",null,6228.41]
["0702011517","Borsisti compresi oneri riflessi","NARDI IRENE",null,2384.1]
["0702011517","Borsisti compresi oneri riflessi","MINISTERO DELLE FINANZE",null,1902.44]
["0702011517","Borsisti compresi oneri riflessi","I.N.P.S. ",null,130528.67]
["0702011517","Borsisti compresi oneri riflessi","IRAP",null,25806.98]
["0702011517","Borsisti compresi oneri riflessi",null,null,{"$f":"SUM(E39:E109)","v":1024154.57}]
["0702011518","Personale religioso adibito a mansioni umanitarie","BENEFICIARI DIVERSI PERSONALE DIPENDENTE",null,22722.98]
["0702011518","Personale religioso adibito a mansioni umanitarie","MINISTERO DELLE FINANZE",24055.460000000003,24639.38]
["0702011518","Personale religioso adibito a mansioni umanitarie",null,null,{"$f":"SUM(E111:E112)","v":47362.36}]
["0702011519","Medicina penitenziaria","MEDICI ADDETTI ALLA GUARDIA MEDICA FESTIVA",null,11858.88]
["0702011519","Medicina penitenziaria","DODI IDA MADDALENA",null,15560]
["0702011519","Medicina penitenziaria","NANNI NANNI GIANLUCA",null,19711]
["0702011519","Medicina penitenziaria","SANTURBANO VALERIANO",null,23755.82]
["0702011519","Totale Medicina penitenziaria",null,null,{"$f":"SUM(E114:E117)","v":70885.7}]
["VOCE BA 1380 - TOTALE CONSULENZE, COLLABORAZIONI, INTERINALE, ALTRE PRESTAZIONI DI LAVORO SANITARIE E SOCIO-SANITARIE DA PRIVATO",null,null,null,{"$f":"E7+E18+E25+E27+E29+E31+E110+E113+E118+E38","v":6390500.9300000006}]
[]
[]
[]
["La voce di CE BA1380 \"Consulenze , collaborazioni, interinale e altre prestazioni di lavoro sanitarie e sociosanitarie da privato\" ammonta, al 31/12/2017, ad €/000 6.390 ed è aumentata, rispetto al 2016, di circa €/000 687. Tale scostamento è stato determinato prevalentemente dai maggiori costi per lavoro interinale (€/000 + 1.050), in parte finanziati con fondi da Progetti Obiettivo, dovuti al fatto che l'Azienda nel 2017 ha fatto maggiore ricorso a tale tipologia di contratto di lavoro rispetto al 2016. Dall'altro lato, si sono ridotti i costi per consulenze sanitarie da privato ex art. 55, comma 2, CCNL 8 giugno 2000, per €/000 - 283, a cui l'Azienda ha fatto ricorso per fronteggiare le urgenze o per potenziare alcuni servizi sanitari (ad esempio il terzo turno di dialisi)."]

{"sheet":"AS04","index":22,"n_rows":67,"n_cols":4,"rows_kept":67,"cut":false,"hidden":false,"merged":[[0,0,0,6],[4,0,4,3],[6,1,6,2],[66,0,66,3],[2,1,2,3],[11,0,11,3],[46,1,46,2],[47,0,47,2],[23,1,23,2],[7,1,7,2],[8,0,8,2],[51,1,51,2],[52,0,52,2],[62,1,62,2],[63,0,63,2],[64,0,64,2]]}
["AS04 - Consulenze, Collaborazioni, Interinale e altre prestazioni di lavoro non sanitarie"]
[]
["AS04 - SI","Nell'esercizio sono stati rilevati costi per consulenze, collaborazioni, interinale e altre prestazioni di lavoro non sanitarie. Si veda dettaglio sottostante per tipologia prestazione, soggetto fornitore e importo."]
[]
["Dettaglio composizione voce BA1790 \nConsulenze non sanitarie da privato\n Consuntivo 2017"]
["TIPOLOGIA","DURATA CONTRATTO","DECORRENZA","IMPORTO IMPUTATO A CE CONSUNTIVO 2017"]
["Consulenze tecniche","Incarico professionale a prestazione unica",null,37124.1]
["Consulenze legali","Incarico professionale a prestazione unica",null,481583.35]
["Totale voce BA1790  CONSUNTIVO 2017 ",null,null,{"$f":"SUM(D7:D8)","v":518707.44999999995}]
[]
[]
["DETTAGLIO VOCE CE BA1780 - \"CONSULENZE, COLLABORAZIONI, INTERINALE E ALTRE PRESTAZIONI DI LAVORO NON SANITARIE DA PRIVATO\""]
[]
["Cod. Conto","Descrizione","Fornitore","Importo"]
["0702020204","Consulenze tecniche","MARTELLA ING. ACHILLE CLAUDIO",1903.2]
["0702020204","Consulenze tecniche","POMPONIO MICHELE",1091.3800000000001]
["0702020204","Consulenze tecniche","PROSPERI ANTONINO",13246.87]
["0702020204","Consulenze tecniche","IEZZI MIRCO",507.52]
["0702020204","Consulenze tecniche","DELLA PENNA MAURO",6344]
["0702020204","Consulenze tecniche","PARISIO MATTEO",3086.53]
["0702020204","Consulenze tecniche","ARCH.FRANCO FELICIANI ENERGY MANAGER",6100]
["0702020204","Consulenze tecniche","DI SALVATORE ARIANNA",4440.8]
["0702020204","Consulenze tecniche","SETTA CARLO",403.8]
["0702020204","Totale consulenze tecniche",null,{"$f":"SUM(D15:D23)","v":37124.100000000006}]
["0702020205","Consulenze legali","CERCEO GIULIO STUDIO LEGALE",17442.78]
["0702020205","Consulenze legali","RUSSI AVV. DOMENICO",45680.800000000003]
["0702020205","Consulenze legali","STUDIO LEGALE AVV.TI TENAGLIA",13727.31]
["0702020205","Consulenze legali","MARCHESE TOMMASO",64415.45]
["0702020205","Consulenze legali","MODESTI ANDREA",14418.48]
["0702020205","Consulenze legali","ANGIOLELLI DANTE AVV.",149471.06]
["0702020205","Consulenze legali","ALESSANDRINI PIETRO",8615.2900000000009]
["0702020205","Consulenze legali","RIARIO SFORZA MARCO AVV.",1415.98]
["0702020205","Consulenze legali","ROSSI STEFANO",26671.89]
["0702020205","Consulenze legali","SURRICCHIO LUCIA",9999.94]
["0702020205","Consulenze legali","D'OVIDIO ANTONIO",3647.8]
["0702020205","Consulenze legali","GIANCOLA TETI & ASSOCIATI",36399.980000000003]
["0702020205","Consulenze legali","ANTONUCCI VINCENZO AVV.",5202.59]
["0702020205","Consulenze legali","LUPO TIMINI LORENZO",19475.97]
["0702020205","Consulenze legali","NIEDDU FABIO",12065.05]
["0702020205","Consulenze legali","FAIETA ANTONELLA",6735.04]
["0702020205","Consulenze legali","GENTILINI FEDERICO",14997.99]
["0702020205","Consulenze legali","DE FEBIS ALESSANDRA",3995.07]
["0702020205","Consulenze legali","LA MORGIA CAMILLO",4172.49]
["0702020205","Consulenze legali","DI IORIO DANIELE",297.52999999999997]
["0702020205","Consulenze legali","MUNDO CARLA",17627.939999999999]
["0702020205","Consulenze legali","VALENTE ANGELO",5106.92]
["0702020205","Totale consulenze legali",null,{"$f":"SUM(D25:D46)","v":481583.34999999992}]
["TOTALE CONSULENZE NON SANITARIE DA PRIVATO (Voce BA1790)",null,null,{"$f":"D24+D47","v":518707.44999999995}]
[]
["0702020215","Collaborazioni coordinate e continuative non sanitarie da privato - ruolo amministrativo","LORENZINI VINCENZO",11255.51]
["0702020215","Collaborazioni coordinate e continuative non sanitarie da privato - ruolo amministrativo","INPS",2279.88]
["0702020215","Collaborazioni coordinate e continuative non sanitarie da privato - ruolo amministrativo",null,{"$f":"SUM(D50:D51)","v":13535.39}]
["TOTALE COLLABORAZIONI COORDINATE E CONTINUATIVE NON SANITARIE DA PRIVATO (Voce BA1800)",null,null,{"$f":"D52","v":13535.39}]
[]
["0702020223","Personale religioso adibito a mansioni non sanitarie","PROBI MARIO",22800.01]
["0702020223","Personale religioso adibito a mansioni non sanitarie","CURIA METROPOLITANA PESCARA-PENNE",6000]
["0702020223","Personale religioso adibito a mansioni non sanitarie","SEDOGO WENDE GOUDA ALBERT",22799.97]
["0702020223","Personale religioso adibito a mansioni non sanitarie","LIBAKATA BOIKANI",22800.52]
["0702020223","Personale religioso adibito a mansioni non sanitarie","DIOCESI SULMONA-VALVA",2700]
["0702020223","Personale religioso adibito a mansioni non sanitarie","MANDELLI GIANCARLO",15200.04]
["0702020223","Personale religioso adibito a mansioni non sanitarie","INPS",17569.87]
["0702020223","Personale religioso adibito a mansioni non sanitarie","IRAP",7511.65]
["0702020223","Totale personale religioso adibito a mansioni non sanitarie",null,{"$f":"SUM(D55:D62)","v":117382.06}]
["ALTRE COLLABORAZIONI E PRESTAZIONI DI LAVORO - AREA NON SANITARIA (Voce BA1830)",null,null,{"$f":"D63","v":117382.06}]
["VOCE BA 1780 - TOTALE CONSULENZE, COLLABORAZIONI, INTERINALE E ALTRE PRESTAZIONI DI LAVORO NON SANITARIE DA PRIVATO",null,null,{"$f":"D48+D53+D64","v":649624.89999999991}]
[]
["La voce di CE BA1780 \"Consulenze , collaborazioni, interinale e altre prestazioni di lavoro non sanitarie da privato\" ammonta, al 31/12/2017, ad €/000 650 e si è ridotta, rispetto al 2016, di circa €/000 82. Tale scostamento è dovuto principalmente alla riduzione dei costi per consulenze tecniche (- €/000 224), parzialmente compensato dall'incremento delle spese per consulenze legali, il cui ammontare può subire alcune variazioni, da un anno all'altro, in relazione al numero ed all'esito dei contenziosi conclusi nel corso dell'esercizio. Il costo delle consulenze tecniche è diminuito in quanto nel 2017 è venuta meno la spesa relativa all'incarico del broker per la gara dell'assicurazione RCT, espletata nel precedente esercizio. "]

{"sheet":"Tab 62","index":23,"n_rows":59,"n_cols":6,"rows_kept":59,"cut":false,"hidden":false,"merged":[[56,0,56,5],[57,0,57,5],[58,0,58,5],[1,5,2,5],[0,1,0,5],[1,0,2,0],[1,1,2,1],[1,2,2,2],[1,3,2,3],[1,4,2,4]]}
[null,"Tab. 62 – Dettaglio acquisti di servizi non sanitari "]
["CODICE MOD. CE","DETTAGLIO ACQUISTI DI SERVIZI NON SANITARI",{"$f":"\"Valore CE \" &'00 Aggregatore'!$F$2","v":"Valore CE 2017"},{"$f":"\"Valore CE \" &'00 Aggregatore'!$F$2 -1","v":"Valore CE 2016"},"Variazioni\nimporto","%"]
[]
[null,"SERVIZI NON SANITARI",{"$f":"SUM(C5:C18)","v":35538780.359999992},{"$f":"SUM(D5:D18)","v":36561957.619999997},{"$f":"C4-D4","v":-1023177.2600000054},{"$f":"IF(AND(C4=0,D4=0),0,IF(C4=0,\"\",IF(D4=0,\"\",E4/D4)))","v":-2.798475045111672E-2}]
["BA1580","Lavanderia",{"$f":"SUMIF('00 CE'!$B:$B,'Tab 62'!$A5,'00 CE'!G:G)","v":5274953.32},{"$f":"SUMIF('00 CE'!$B:$B,'Tab 62'!$A5,'00 CE'!F:F)","v":6717141.3899999997},{"$f":"C5-D5","v":-1442188.0699999994},{"$f":"IF(AND(C5=0,D5=0),0,IF(C5=0,\"\",IF(D5=0,\"\",E5/D5)))","v":-0.21470265195653407}]
["BA1590","Pulizia",{"$f":"SUMIF('00 CE'!$B:$B,'Tab 62'!$A6,'00 CE'!G:G)","v":6089443.3399999999},{"$f":"SUMIF('00 CE'!$B:$B,'Tab 62'!$A6,'00 CE'!F:F)","v":6128265.6900000004},{"$f":"C6-D6","v":-38822.350000000559},-6.3349652191728905E-3]
["BA1600","Mensa",{"$f":"SUMIF('00 CE'!$B:$B,'Tab 62'!$A7,'00 CE'!G:G)","v":4117793.49},{"$f":"SUMIF('00 CE'!$B:$B,'Tab 62'!$A7,'00 CE'!F:F)","v":3982167.1},135626.39000000013,3.4058437678318454E-2]
["BA1610","Riscaldamento",{"$f":"SUMIF('00 CE'!$B:$B,'Tab 62'!$A8,'00 CE'!G:G)","v":1064233.96},{"$f":"SUMIF('00 CE'!$B:$B,'Tab 62'!$A8,'00 CE'!F:F)","v":1027893.49},36340.469999999972,3.5354314774383847E-2]
["BA1620","Servizi di assistenza informatica",{"$f":"SUMIF('00 CE'!$B:$B,'Tab 62'!$A9,'00 CE'!G:G)","v":1666759.65},{"$f":"SUMIF('00 CE'!$B:$B,'Tab 62'!$A9,'00 CE'!F:F)","v":1500622.2},166137.44999999995,0.11071237650622519]
["BA1630","Servizi trasporti (non sanitari)",{"$f":"SUMIF('00 CE'!$B:$B,'Tab 62'!$A10,'00 CE'!G:G)","v":9272},{"$f":"SUMIF('00 CE'!$B:$B,'Tab 62'!$A10,'00 CE'!F:F)","v":0},9272,""]
["BA1640","Smaltimento rifiuti",{"$f":"SUMIF('00 CE'!$B:$B,'Tab 62'!$A11,'00 CE'!G:G)","v":1384638.6300000001},{"$f":"SUMIF('00 CE'!$B:$B,'Tab 62'!$A11,'00 CE'!F:F)","v":1294794.04},89844.590000000084,6.9389097589605903E-2]
["BA1650","Utenze telefoniche",{"$f":"SUMIF('00 CE'!$B:$B,'Tab 62'!$A12,'00 CE'!G:G)","v":524835.69999999995},{"$f":"SUMIF('00 CE'!$B:$B,'Tab 62'!$A12,'00 CE'!F:F)","v":493458.34},31377.359999999928,6.3586644416628826E-2]
["BA1660","Utenze elettricità",{"$f":"SUMIF('00 CE'!$B:$B,'Tab 62'!$A13,'00 CE'!G:G)","v":3156167.9},{"$f":"SUMIF('00 CE'!$B:$B,'Tab 62'!$A13,'00 CE'!F:F)","v":3423484.08},-267316.18000000017,-7.8083079621039206E-2]
["BA1670","Altre utenze",{"$f":"SUMIF('00 CE'!$B:$B,'Tab 62'!$A14,'00 CE'!G:G)","v":705877.73},{"$f":"SUMIF('00 CE'!$B:$B,'Tab 62'!$A14,'00 CE'!F:F)","v":461862.87},244014.86,0.52832750985157129]
["BA1680","Premi di assicurazione",{"$f":"SUMIF('00 CE'!$B:$B,'Tab 62'!$A15,'00 CE'!G:G)","v":4810016.04},{"$f":"SUMIF('00 CE'!$B:$B,'Tab 62'!$A15,'00 CE'!F:F)","v":4906195.92},-96179.879999999888,-1.9603758506244056E-2]
["BA1720","Altri servizi non sanitari da pubblico (Aziende sanitarie pubbliche della Regione)",{"$f":"SUMIF('00 CE'!$B:$B,'Tab 62'!$A16,'00 CE'!G:G)","v":0},{"$f":"SUMIF('00 CE'!$B:$B,'Tab 62'!$A16,'00 CE'!F:F)","v":0},0,0]
["BA1730","Altri servizi non sanitari da altri soggetti pubblici",{"$f":"SUMIF('00 CE'!$B:$B,'Tab 62'!$A17,'00 CE'!G:G)","v":0},{"$f":"SUMIF('00 CE'!$B:$B,'Tab 62'!$A17,'00 CE'!F:F)","v":0},0,0]
["BA1740","Altri servizi non sanitari da privato",{"$f":"SUMIF('00 CE'!$B:$B,'Tab 62'!$A18,'00 CE'!G:G)","v":6734788.6000000006},{"$f":"SUMIF('00 CE'!$B:$B,'Tab 62'!$A18,'00 CE'!F:F)","v":6626072.5000000009},108716.09999999963,1.6407321229883857E-2]
["0702020118","Vigilanza",1862266.45,1767664.59,94601.85999999987,5.351799234717932E-2]
["0702020119","Altri servizi appaltati",4379343.09,4221198.53,158144.55999999959,3.7464373891933384E-2]
["0702020120","Spese di rappresentanza",949,2464.4,-1515.4,-0.61491640967375427]
["0702020121","Spese postali",251509.11,390516.72,-139007.60999999999,-0.35595815206068515]
["0702020122","Quote per spese condominiali",21247.49,31412.03,-10164.539999999997,-0.32358749179852425]
["0702020123","Spese legali",85408.79,117701.67,-32292.880000000005,-0.27436212247455799]
["0702020124","Bolli e marchi",58649.21,57826.73,822.47999999999593,1.4223180179823342E-2]
["0702020125","Abbonamenti, riviste e libri",37522.53,34447.629999999997,3074.9000000000015,8.9263034931575891E-2]
["0702020126","Spese per liti, arbitraggi e risarcimenti",0,0,0,0]
["0702020127","Altri servizi non sanitari da privato",37851.33,2640,35211.33,13.337625000000001]
["0702020128","Rimborsi spese personale del ruolo sanitario dirigenza medica",0,0,0,0]
["0702020129","Rimborsi spese personale del ruolo sanitario dirigenza non medica",0,0,0,0]
["0702020130","Rimborsi spese personale del ruolo sanitario comparto",41.6,24,17.600000000000001,0.73333333333333339]
["0702020131","Rimborsi spese personale del ruolo professionale dirigenza",0,0,0,0]
["0702020132","Rimborsi spese personale del ruolo professionale comparto",0,0,0,0]
["0702020133","Rimborsi spese personale del ruolo tecnico dirigenza",0,0,0,0]
["0702020134","Rimborsi spese personale del ruolo tecnico comparto",0,176.2,-176.2,""]
["0702020135","Rimborsi spese personale del ruolo amministrativo dirigenza",0,0,0,0]
["0702020136","Rimborsi spese personale del ruolo amministrativo comparto",0,0,0,0]
[null,"CONSULENZE, COLLABORAZIONI, INTERINALE, ALTRE PRESTAZIONI DI LAVORO NON SANITARIE ",{"$f":"SUM(C39:C41)","v":649624.89999999991},{"$f":"SUM(D39:D41)","v":731816.37},-82191.470000000088,-0.1123116035242558]
["BA1760","Consulenze non sanitarie da Aziende sanitarie pubbliche della Regione",{"$f":"SUMIF('00 CE'!$B:$B,'Tab 62'!$A39,'00 CE'!G:G)","v":0},{"$f":"SUMIF('00 CE'!$B:$B,'Tab 62'!$A39,'00 CE'!F:F)","v":0},{"$f":"C39-D39","v":0},0]
["BA1770","Consulenze non sanitarie da Terzi - Altri soggetti pubblici",{"$f":"SUMIF('00 CE'!$B:$B,'Tab 62'!$A40,'00 CE'!G:G)","v":0},{"$f":"SUMIF('00 CE'!$B:$B,'Tab 62'!$A40,'00 CE'!F:F)","v":0},{"$f":"C40-D40","v":0},0]
["BA1780","Consulenze, Collaborazioni, Interinale e altre prestazioni di lavoro non sanitarie da privato",{"$f":"SUMIF('00 CE'!$B:$B,'Tab 62'!$A41,'00 CE'!G:G)","v":649624.89999999991},{"$f":"SUMIF('00 CE'!$B:$B,'Tab 62'!$A41,'00 CE'!F:F)","v":731816.37},-82191.470000000088,-0.1123116035242558]
["BA1790","Consulenze non sanitarie da privato",{"$f":"SUMIF('00 CE'!$B:$B,'Tab 62'!$A42,'00 CE'!G:G)","v":518707.44999999995},{"$f":"SUMIF('00 CE'!$B:$B,'Tab 62'!$A42,'00 CE'!F:F)","v":614217.07999999996},-95509.63,-0.15549816686960255]
["BA1800","Collaborazioni coordinate e continuative non sanitarie da privato",{"$f":"SUMIF('00 CE'!$B:$B,'Tab 62'!$A43,'00 CE'!G:G)","v":13535.39},{"$f":"SUMIF('00 CE'!$B:$B,'Tab 62'!$A43,'00 CE'!F:F)","v":25849.06},-12313.670000000002,-0.47636819288593091]
["BA1810","Indennità a personale universitario - area non sanitaria ",{"$f":"SUMIF('00 CE'!$B:$B,'Tab 62'!$A44,'00 CE'!G:G)","v":0},{"$f":"SUMIF('00 CE'!$B:$B,'Tab 62'!$A44,'00 CE'!F:F)","v":0},0,0]
["BA1820","Lavoro interinale - area non sanitaria ",{"$f":"SUMIF('00 CE'!$B:$B,'Tab 62'!$A45,'00 CE'!G:G)","v":0},{"$f":"SUMIF('00 CE'!$B:$B,'Tab 62'!$A45,'00 CE'!F:F)","v":0},0,0]
["BA1830","Altre collaborazioni e prestazioni di lavoro - area non sanitaria ",{"$f":"SUMIF('00 CE'!$B:$B,'Tab 62'!$A46,'00 CE'!G:G)","v":117382.06},{"$f":"SUMIF('00 CE'!$B:$B,'Tab 62'!$A46,'00 CE'!F:F)","v":91750.23},25631.83,0.2793652942341398]
["BA1840","Rimborso oneri stipendiali del personale non sanitario in comando",{"$f":"SUMIF('00 CE'!$B:$B,'Tab 62'!$A47,'00 CE'!G:G)","v":0},{"$f":"SUMIF('00 CE'!$B:$B,'Tab 62'!$A47,'00 CE'!F:F)","v":0},0,0]
["BA1850","Rimborso oneri stipendiali personale non sanitario in comando da Aziende sanitarie pubbliche della Regione",{"$f":"SUMIF('00 CE'!$B:$B,'Tab 62'!$A48,'00 CE'!G:G)","v":0},{"$f":"SUMIF('00 CE'!$B:$B,'Tab 62'!$A48,'00 CE'!F:F)","v":0},0,0]
["BA1860","Rimborso oneri stipendiali personale non sanitario in comando da Regione, soggetti pubblici e da Università",{"$f":"SUMIF('00 CE'!$B:$B,'Tab 62'!$A49,'00 CE'!G:G)","v":0},{"$f":"SUMIF('00 CE'!$B:$B,'Tab 62'!$A49,'00 CE'!F:F)","v":0},0,0]
["BA1870","Rimborso oneri stipendiali personale non sanitario in comando da aziende di altre Regioni (Extraregione)",{"$f":"SUMIF('00 CE'!$B:$B,'Tab 62'!$A50,'00 CE'!G:G)","v":0},{"$f":"SUMIF('00 CE'!$B:$B,'Tab 62'!$A50,'00 CE'!F:F)","v":0},0,0]
[null,"FORMAZIONE",{"$f":"C52+C53","v":597344.22},{"$f":"D52+D53","v":628434.62},{"$f":"C51-D51","v":-31090.400000000023},-4.9472767747900367E-2]
["BA1890","Formazione (esternalizzata e non) da pubblico",{"$f":"SUMIF('00 CE'!$B:$B,'Tab 62'!$A52,'00 CE'!G:G)","v":81237.64},{"$f":"SUMIF('00 CE'!$B:$B,'Tab 62'!$A52,'00 CE'!F:F)","v":67387.399999999994},{"$f":"C52-D52","v":13850.240000000005},0.20553159789515557]
["BA1900","Formazione (esternalizzata e non) da privato",{"$f":"SUMIF('00 CE'!$B:$B,'Tab 62'!$A53,'00 CE'!G:G)","v":516106.58},{"$f":"SUMIF('00 CE'!$B:$B,'Tab 62'!$A53,'00 CE'!F:F)","v":561047.22},{"$f":"C53-D53","v":-44940.639999999956},-8.0101350470999491E-2]
[null,"TOTALE",{"$f":"C4+C38+C51","v":36785749.479999989},{"$f":"D4+D38+D51","v":37922208.609999992},{"$f":"E4+E38+E51","v":-1136459.1300000055},-2.996816830178831E-2]
[]
[]
["Il costo per l'acquisto di servizi non sanitari si è ridotto complessivamente, rispetto al 2016, di circa €/000 -880. Le variazioni maggiormente significative riguardano:"]
["- La riduzione del costo del servizio di lavanderia, per - €/000 1.442: detto decremento è dovuto a due fattori. In primo luogo, mentre fino al 31/03/2017 la gestione del contratto di lavanolo da parte delle due ditte componenti l'ATI non è stata lineare dal punto di vista della quota di spettanza dei singoli lotti, al punto che le due ditte hanno fatturato entrambe le medesime aree di gestione del servizio (tale situazione, contestata dall'azienda, è in attesa di definizione in sede giudiziaria), a partire dal 01/04/2017 la ASL è intervenuta per definire con chiarezza le quote di fatturazione di competenza di ciascuna ditta. In secondo luogo, a partire dalla stessa data (01/04/2017), i prezzi del servizio sono stati rimodulati in base ai prezzi di riferimento ANAC, più vantaggiosi."]
["- La variazione descritta al precedente punto è stata parzialmente compensata da lievi incrementi di altre voci di spesa, tra i quali i più significativi sono i costi per il servizio mensa (+ €/000 135), per i servizi di assistenza informatica (+ €/000 166) e per utenze varie (+ €/000 244). "]

{"sheet":"Tab 63","index":24,"n_rows":22,"n_cols":6,"rows_kept":22,"cut":false,"hidden":false,"merged":[[21,0,21,5],[2,0,5,5],[0,0,0,6],[7,1,7,5],[8,0,9,0],[8,1,9,1],[8,2,9,2],[8,3,9,3],[8,4,9,4],[8,5,9,5]]}
["AS05 - Manutenzioni e riparazioni"]
[]
["Sono considerate di carattere ordinario le prestazioni di manutenzione finalizzate al normale mantenimento e riparazione dei cespiti, che non comportano un significativo aumento della produttività o della vita utile del bene. In tal caso i relativi costi sono imputati al conto economico, secondo il principio della competenza economica. Qualora invece le spese per manutenzione comportano un miglioramento del bene e ne producono l'allungamento della vita utile, il miglioramento della produttività o della sicurezza, esse sono considerate di carattere straordinario, ed i costi relativi sono imputati al bene oggetto del servizio e capitalizzati. "]
[]
[]
[]
[]
[null,"Tab. 63 – Dettaglio manutenzioni e riparazioni "]
["CODICE MOD. CE","DETTAGLIO MANUTENZIONI E RIPARAZIONI",{"$f":"\"Valore CE \" &'00 Aggregatore'!$F$2","v":"Valore CE 2017"},{"$f":"\"Valore CE \" &'00 Aggregatore'!$F$2 -1","v":"Valore CE 2016"},"Variazioni \nimporto","%"]
[]
["BA1920","Manutenzione e riparazione ai fabbricati e loro pertinenze",{"$f":"SUMIF('00 CE'!$B:$B,'Tab 63'!$A11,'00 CE'!G:G)","v":9244877.5800000001},{"$f":"SUMIF('00 CE'!$B:$B,'Tab 63'!$A11,'00 CE'!F:F)","v":7832253.2599999998},{"$f":"C11-D11","v":1412624.3200000003},{"$f":"IF(AND(C11=0,D11=0),0,IF(C11=0,\"\",IF(D11=0,\"\",E11/C11)))","v":0.15280075996420067}]
["BA1930","Manutenzione e riparazione agli impianti e macchinari",{"$f":"SUMIF('00 CE'!$B:$B,'Tab 63'!$A12,'00 CE'!G:G)","v":0},{"$f":"SUMIF('00 CE'!$B:$B,'Tab 63'!$A12,'00 CE'!F:F)","v":0},{"$f":"C12-D12","v":0},{"$f":"IF(AND(C12=0,D12=0),0,IF(C12=0,\"\",IF(D12=0,\"\",E12/C12)))","v":0}]
["BA1940","Manutenzione e riparazione alle attrezzature sanitarie e scientifiche",{"$f":"SUMIF('00 CE'!$B:$B,'Tab 63'!$A13,'00 CE'!G:G)","v":5502395.79},{"$f":"SUMIF('00 CE'!$B:$B,'Tab 63'!$A13,'00 CE'!F:F)","v":5435954.5999999996},66441.19000000041,1.2074956534524466E-2]
["BA1950","Manutenzione e riparazione ai mobili e arredi",{"$f":"SUMIF('00 CE'!$B:$B,'Tab 63'!$A14,'00 CE'!G:G)","v":0},{"$f":"SUMIF('00 CE'!$B:$B,'Tab 63'!$A14,'00 CE'!F:F)","v":0},0,0]
["BA1960","Manutenzione e riparazione agli automezzi",{"$f":"SUMIF('00 CE'!$B:$B,'Tab 63'!$A15,'00 CE'!G:G)","v":109400.27},{"$f":"SUMIF('00 CE'!$B:$B,'Tab 63'!$A15,'00 CE'!F:F)","v":132622.04},-23221.770000000004,-0.21226428417407017]
["BA1970","Altre manutenzioni e riparazioni",{"$f":"SUMIF('00 CE'!$B:$B,'Tab 63'!$A16,'00 CE'!G:G)","v":873012.59},{"$f":"SUMIF('00 CE'!$B:$B,'Tab 63'!$A16,'00 CE'!F:F)","v":907722.94},-34710.349999999977,-3.9759277698389182E-2]
["BA1980","Manutenzioni e riparazioni da Aziende sanitarie pubbliche della Regione",{"$f":"SUMIF('00 CE'!$B:$B,'Tab 63'!$A17,'00 CE'!G:G)","v":0},{"$f":"SUMIF('00 CE'!$B:$B,'Tab 63'!$A17,'00 CE'!F:F)","v":0},0,0]
[null,"TOTALE",{"$f":"SUM(C11:C17)","v":15729686.23},{"$f":"SUM(D11:D17)","v":14308552.839999998},{"$f":"SUM(E11:E17)","v":1421133.3900000006},9.0347217943202454E-2]
[]
[]
[]
["La variazione maggiormente significativa riguarda la voce manutenzioni e riparazioni ai fabbricati e loro pertinenze, che ha subito un incremento di circa €/000 1.412 rispetto al 2016, a causa delle maggiori esigenze manutentive avvertite dall'Azienda nel corrente esercizio.   "]

{"sheet":"Tab 64-65","index":25,"n_rows":40,"n_cols":10,"rows_kept":40,"cut":false,"hidden":false,"merged":[[38,5,38,7],[39,5,39,7],[35,5,35,7],[34,5,34,7],[32,1,33,1],[32,2,33,2],[36,5,36,7],[37,5,37,7],[32,8,33,8],[32,9,33,9],[2,0,3,0],[2,1,3,1],[2,2,3,2],[2,3,2,4],[2,5,3,5],[32,3,33,3],[32,4,33,4],[32,5,33,7]]}
[]
[null,"Tab. 64 – Dettaglio costi per contratti multiservizio "]
["CODICE MOD. CE","DETTAGLIO COSTI PER \nCONTRATTI MULTISERVIZIO (GLOBAL SERVICE)",{"$f":"\"Valore CE \" &'00 Aggregatore'!$F$2","v":"Valore CE 2017"},"TIPOLOGIA DI CONTRATTO",null,"% di incidenza\nmultiservizio"]
[null,null,null,"Importo Multiservizio","Importo Altro"]
["BA1580","Lavanderia",{"$f":"SUMIF('00 CE'!$B:$B,$A5,'00 CE'!$G:$G)","v":5274953.32},0,{"$f":"C5-D5","v":5274953.32},{"$f":"IF(D5=0,0,IF(C5=0,\"\",D5/C5))","v":0}]
["BA1590","Pulizia",{"$f":"SUMIF('00 CE'!$B:$B,$A6,'00 CE'!$G:$G)","v":6089443.3399999999},0,6089443.3399999999,0]
["BA1600","Mensa",{"$f":"SUMIF('00 CE'!$B:$B,$A7,'00 CE'!$G:$G)","v":4117793.49},0,4117793.49,0]
["BA1610","Riscaldamento",{"$f":"SUMIF('00 CE'!$B:$B,$A8,'00 CE'!$G:$G)","v":1064233.96},0,1064233.96,0]
["BA1620","Servizi di assistenza informatica",{"$f":"SUMIF('00 CE'!$B:$B,$A9,'00 CE'!$G:$G)","v":1666759.65},0,1666759.65,0]
["BA1630","Servizi trasporti (non sanitari)",{"$f":"SUMIF('00 CE'!$B:$B,$A10,'00 CE'!$G:$G)","v":9272},0,9272,0]
["BA1640","Smaltimento rifiuti",{"$f":"SUMIF('00 CE'!$B:$B,$A11,'00 CE'!$G:$G)","v":1384638.6300000001},0,1384638.6300000001,0]
["BA1650","Utenze telefoniche",{"$f":"SUMIF('00 CE'!$B:$B,$A12,'00 CE'!$G:$G)","v":524835.69999999995},0,524835.69999999995,0]
["BA1660","Utenze elettricità",{"$f":"SUMIF('00 CE'!$B:$B,$A13,'00 CE'!$G:$G)","v":3156167.9},0,3156167.9,0]
["BA1670","Altre utenze",{"$f":"SUMIF('00 CE'!$B:$B,$A14,'00 CE'!$G:$G)","v":705877.73},0,705877.73,0]
["BA1680","Premi di assicurazione",{"$f":"SUMIF('00 CE'!$B:$B,$A15,'00 CE'!$G:$G)","v":4810016.04},0,4810016.04,0]
["BA1720","Altri servizi non sanitari da pubblico (Aziende sanitarie pubbliche della Regione)",{"$f":"SUMIF('00 CE'!$B:$B,$A16,'00 CE'!$G:$G)","v":0},0,0,0]
["BA1730","Altri servizi non sanitari da altri soggetti pubblici",{"$f":"SUMIF('00 CE'!$B:$B,$A17,'00 CE'!$G:$G)","v":0},0,0,0]
["BA1740","Altri servizi non sanitari da privato",{"$f":"SUMIF('00 CE'!$B:$B,$A18,'00 CE'!$G:$G)","v":6734788.6000000006},0,6734788.6000000006,0]
["BA1890","Formazione (esternalizzata e non) da pubblico",{"$f":"SUMIF('00 CE'!$B:$B,$A19,'00 CE'!$G:$G)","v":81237.64},0,81237.64,0]
["BA1900","Formazione (esternalizzata e non) da privato",{"$f":"SUMIF('00 CE'!$B:$B,$A20,'00 CE'!$G:$G)","v":516106.58},0,516106.58,0]
["BA1910","Manutenzione e riparazione (ordinaria esternalizzata):",{"$f":"SUMIF('00 CE'!$B:$B,$A21,'00 CE'!$G:$G)","v":15729686.23},0,15729686.23,0]
["BA1920","Manutenzione e riparazione ai fabbricati e loro pertinenze",{"$f":"SUMIF('00 CE'!$B:$B,$A22,'00 CE'!$G:$G)","v":9244877.5800000001},0,9244877.5800000001,0]
["BA1930","Manutenzione e riparazione agli impianti e macchinari",{"$f":"SUMIF('00 CE'!$B:$B,$A23,'00 CE'!$G:$G)","v":0},0,0,0]
["BA1940","Manutenzione e riparazione alle attrezzature sanitarie e scientifiche",{"$f":"SUMIF('00 CE'!$B:$B,$A24,'00 CE'!$G:$G)","v":5502395.79},0,5502395.79,0]
["BA1950","Manutenzione e riparazione ai mobili e arredi",{"$f":"SUMIF('00 CE'!$B:$B,$A25,'00 CE'!$G:$G)","v":0},0,0,0]
["BA1960","Manutenzione e riparazione agli automezzi",{"$f":"SUMIF('00 CE'!$B:$B,$A26,'00 CE'!$G:$G)","v":109400.27},0,109400.27,0]
["BA1970","Altre manutenzioni e riparazioni",{"$f":"SUMIF('00 CE'!$B:$B,$A27,'00 CE'!$G:$G)","v":873012.59},0,873012.59,0]
["BA1980","Manutenzioni e riparazioni da Aziende sanitarie pubbliche della Regione",{"$f":"SUMIF('00 CE'!$B:$B,$A28,'00 CE'!$G:$G)","v":0},0,0,0]
[null,"TOTALE",{"$f":"SUM(C5:C21)","v":51865810.809999987},0,51865810.809999987,0]
[]
[]
[null,"Tab. 65 – Dettaglio canoni di leasing "]
[null,"DETTAGLIO LEASING","Valore contratto con IVA","Costo imputato all'esercizio","Canoni a scadere","Delibera",null,null,"Decorrenza contratto","Scadenza contratto"]
[]
[null,"Leasing attivati con fondi aziendali:"]
[null,"Cellule Staminali"]
[null,"Leasing finanziari finanziati dalla Regione:"]
[null,"…"]
[null,"…"]
[null,"…"]

{"sheet":"Tab 66-67-68-69","index":26,"n_rows":175,"n_cols":11,"rows_kept":175,"cut":false,"hidden":false,"merged":[[174,1,174,5],[134,1,134,5],[135,0,136,0],[135,1,136,1],[135,2,136,2],[135,3,136,3],[135,4,136,4],[135,5,136,5],[97,5,98,5],[58,1,58,5],[59,0,60,0],[59,1,60,1],[59,2,60,2],[59,3,60,3],[59,4,60,4],[59,5,60,5],[97,0,98,0],[97,1,98,1],[97,2,98,2],[97,3,98,3],[97,4,98,4],[0,0,0,5],[3,1,3,5],[4,0,5,0],[4,1,5,1],[4,2,5,2],[4,3,5,3],[4,4,5,4],[4,5,5,5]]}
["21.     Costi del personale"]
[]
[]
[null,"Tab. 66 – Costi del personale – ruolo sanitario"]
["CODICE MOD. CE","COSTI DEL PERSONALE","Valore CE 2017","Valore CE 2016","Variazioni\nimporto","%"]
[null,null,null,null,null,null,null,"Diff 2015","Ctrl","Diff 2014","Ctrl"]
["BA2090","PERSONALE DEL RUOLO SANITARIO",{"$f":"C8+C41","v":138175218.69},{"$f":"D8+D41","v":140347883.47999999},{"$f":"C7-D7","v":-2172664.7899999917},{"$f":"IF(AND(C7=0,D7=0),0,IF(C7=0,\"\",IF(D7=0,\"\",E7/D7)))","v":-1.5480566832413993E-2}]
["BA2100","Costo del personale dirigente ruolo sanitario",{"$f":"C9+C25","v":73318273.719999999},{"$f":"D9+D25","v":74326376.919999987},{"$f":"C8-D8","v":-1008103.1999999881},{"$f":"IF(AND(C8=0,D8=0),0,IF(C8=0,\"\",IF(D8=0,\"\",E8/D8)))","v":-1.3563195755997147E-2}]
["BA2110","Costo del personale dirigente medico",{"$f":"C10+C17+C24","v":68148859.189999998},{"$f":"D10+D17+D24","v":69192940.819999993},{"$f":"C9-D9","v":-1044081.6299999952},-1.5089424117932661E-2]
["BA2120","Costo del personale dirigente medico - tempo indeterminato",{"$f":"SUMIF('00 CE'!$B:$B,'Tab 66-67-68-69'!$A10,'00 CE'!G:G)","v":66243178.869999997},{"$f":"SUMIF('00 CE'!$B:$B,'Tab 66-67-68-69'!$A10,'00 CE'!F:F)","v":67708491.459999993},{"$f":"C10-D10","v":-1465312.5899999961},-2.1641489249035417E-2,null,{"$f":"C10-(C11+C12+C13+C14+C15+C16)","v":0},{"$f":"IF(H10=0,\"OK\",\" CTRL\")","v":"OK"},{"$f":"D10-(D11+D12+D13+D14+D15+D16)","v":0},{"$f":"IF(J10=0,\"OK\",\" CTRL\")","v":"OK"}]
[null,"Voci di costo a carattere stipendiale",34123950.691818185,35259927.109999999,{"$f":"C11-D11","v":-1135976.4181818143},-3.2217208352074055E-2]
[null,"Retribuzione di posizione",2959281.0400000005,2965378.6499999994,-6097.6099999989383,-2.0562669121526652E-3]
[null,"Indennità di risultato",3696611.3181818188,3703997.569999984,-7386.2518181651831,-1.9941297688716398E-3]
[null,"Altro trattamento accessorio",10064006.789999997,9918290.980000006,145715.80999999121,1.469162482667867E-2]
[null,"Oneri sociali su retribuzione",15117441.619999999,15335969.09,-218527.47000000067,-1.4249342100102046E-2]
[null,"Altri oneri per il personale",281887.41000000003,524928.05999999994,-243040.64999999991,-0.46299801538519381]
["BA2130","Costo del personale dirigente medico - tempo determinato",{"$f":"SUMIF('00 CE'!$B:$B,'Tab 66-67-68-69'!$A17,'00 CE'!G:G)","v":1905680.32},{"$f":"SUMIF('00 CE'!$B:$B,'Tab 66-67-68-69'!$A17,'00 CE'!F:F)","v":1484449.36},{"$f":"C17-D17","v":421230.95999999996},0.28376243161302583,null,{"$f":"C17-(C18+C19+C20+C21+C22+C23)","v":0},{"$f":"IF(H17=0,\"OK\",\" CTRL\")","v":"OK"},{"$f":"D17-(D18+D19+D20+D21+D22+D23)","v":0},{"$f":"IF(J17=0,\"OK\",\" CTRL\")","v":"OK"}]
[null,"Voci di costo a carattere stipendiale",1282681.22,952093.47000000009,{"$f":"C18-D18","v":330587.74999999988},0.34722194870215828]
[null,"Retribuzione di posizione",2328.5700000000002,90909.910000000033,-88581.340000000026,-0.97438596078249329]
[null,"Indennità di risultato",10124.530000000001,0,10124.530000000001,""]
[null,"Altro trattamento accessorio",197516.16,119746.45999999999,77769.700000000012,0.64945301932098887]
[null,"Oneri sociali su retribuzione",413029.84,321699.52,91330.32,0.28389945996810939]
[null,"Altri oneri per il personale",0,0,0,0]
["BA2140","Costo del personale dirigente medico - altro",{"$f":"SUMIF('00 CE'!$B:$B,'Tab 66-67-68-69'!$A24,'00 CE'!G:G)","v":0},{"$f":"SUMIF('00 CE'!$B:$B,'Tab 66-67-68-69'!$A24,'00 CE'!F:F)","v":0},0,0]
["BA2150","Costo del personale dirigente non medico",{"$f":"C26+C33+C40","v":5169414.5299999993},{"$f":"D26+D33+D40","v":5133436.1000000006},35978.429999998771,7.0086447555076734E-3]
["BA2160","Costo del personale dirigente non medico - tempo indeterminato",{"$f":"SUMIF('00 CE'!$B:$B,'Tab 66-67-68-69'!$A26,'00 CE'!G:G)","v":5064518.01},{"$f":"SUMIF('00 CE'!$B:$B,'Tab 66-67-68-69'!$A26,'00 CE'!F:F)","v":5069887.5500000007},-5369.5400000009686,-1.0591043582418248E-3,null,{"$f":"C26-(C27+C28+C29+C30+C31+C32)","v":4.8650102689862251E-3},{"$f":"IF(H26=0,\"OK\",\" CTRL\")","v":" CTRL"},{"$f":"D26-(D27+D28+D29+D30+D31+D32)","v":0},{"$f":"IF(J26=0,\"OK\",\" CTRL\")","v":"OK"}]
[null,"Voci di costo a carattere stipendiale",2744408.62,2752764.02,-8355.3999999999069,-3.0352765218138482E-3]
[null,"Retribuzione di posizione",360768.17000000004,352629.22,8138.9500000000698,2.3080758877554362E-2]
[null,"Indennità di risultato",168195.77513498999,196424.5700000005,-28228.79486501051,-0.14371315597132497]
[null,"Altro trattamento accessorio",727523.52999999968,707649.8600000001,19873.669999999576,2.8084044275794209E-2]
[null,"Oneri sociali su retribuzione",1059409.8600000001,1059349.8600000001,60,5.6638512228622937E-5]
[null,"Altri oneri per il personale",4212.05,1070.02,3142.03,2.9364217491261848]
["BA2170","Costo del personale dirigente non medico - tempo determinato",{"$f":"SUMIF('00 CE'!$B:$B,'Tab 66-67-68-69'!$A33,'00 CE'!G:G)","v":104896.52000000002},{"$f":"SUMIF('00 CE'!$B:$B,'Tab 66-67-68-69'!$A33,'00 CE'!F:F)","v":63548.549999999996},41347.970000000023,0.65065166711120903,null,{"$f":"C33-(C34+C35+C36+C37+C38+C39)","v":0},{"$f":"IF(H33=0,\"OK\",\" CTRL\")","v":"OK"},{"$f":"D33-(D34+D35+D36+D37+D38+D39)","v":0},{"$f":"IF(J33=0,\"OK\",\" CTRL\")","v":"OK"}]
[null,"Voci di costo a carattere stipendiale",76363.53,43635.8,32727.729999999996,0.75002016692715601]
[null,"Retribuzione di posizione",1232.56,4540.5699999999961,-3308.0099999999961,-0.72854509455861249]
[null,"Indennità di risultato",0,0,0,0]
[null,"Altro trattamento accessorio",2950.9999999999995,1674.53,1276.4699999999996,0.76228553683720179]
[null,"Oneri sociali su retribuzione",22573.11,13697.65,8875.4600000000009,0.64795494117604124]
[null,"Altri oneri per il personale",1776.32,0,1776.32,""]
["BA2180","Costo del personale dirigente non medico - altro",{"$f":"SUMIF('00 CE'!$B:$B,'Tab 66-67-68-69'!$A40,'00 CE'!G:G)","v":0},{"$f":"SUMIF('00 CE'!$B:$B,'Tab 66-67-68-69'!$A40,'00 CE'!F:F)","v":0},{"$f":"C40-D40","v":0},0]
["BA2190","Costo del personale comparto ruolo sanitario",{"$f":"C42+C49+C56","v":64856944.969999991},{"$f":"D42+D49+D56","v":66021506.56000001},{"$f":"C41-D41","v":-1164561.5900000185},-1.763912474402066E-2]
["BA2200","Costo del personale comparto ruolo sanitario - tempo indeterminato",{"$f":"SUMIF('00 CE'!$B:$B,'Tab 66-67-68-69'!$A42,'00 CE'!G:G)","v":64044509.309999995},{"$f":"SUMIF('00 CE'!$B:$B,'Tab 66-67-68-69'!$A42,'00 CE'!F:F)","v":65460246.470000006},{"$f":"C42-D42","v":-1415737.1600000113},-2.1627433997652823E-2,null,{"$f":"C42-(C43+C44+C45+C46+C47+C48)","v":0},{"$f":"IF(H42=0,\"OK\",\" CTRL\")","v":"OK"},{"$f":"D42-(D43+D44+D45+D46+D47+D48)","v":0},{"$f":"IF(J42=0,\"OK\",\" CTRL\")","v":"OK"}]
[null,"Voci di costo a carattere stipendiale",43553276.678181812,44264715.609999992,{"$f":"C43-D43","v":-711438.93181817979},-1.6072371007336963E-2]
[null,"Straordinario e indennità personale",1044273.96,879833.03,164440.92999999993,0.18690015536243273]
[null,"Retribuzione per produttività personale",1991913.4518181859,2383128.7500000112,-391215.29818182532,-0.16416037034584199]
[null,"Altro trattamento accessorio",3768572.82,3926907.2199999997,-158334.39999999991,-4.0320382206534514E-2]
[null,"Oneri sociali su retribuzione",13345209.789999999,13631138.380000001,-285928.59000000171,-2.0976134349829825E-2]
[null,"Altri oneri per il personale",341262.60999999993,374523.48,-33260.870000000054,-8.8808504075632469E-2]
["BA2210","Costo del personale comparto ruolo sanitario - tempo determinato",{"$f":"SUMIF('00 CE'!$B:$B,'Tab 66-67-68-69'!$A49,'00 CE'!G:G)","v":812435.66},{"$f":"SUMIF('00 CE'!$B:$B,'Tab 66-67-68-69'!$A49,'00 CE'!F:F)","v":561260.09},{"$f":"C49-D49","v":251175.57000000007},0.44752080982633219,null,{"$f":"C49-(C50+C51+C52+C53+C54+C55)","v":0},{"$f":"IF(H49=0,\"OK\",\" CTRL\")","v":"OK"},{"$f":"D49-(D50+D51+D52+D53+D54+D55)","v":0},{"$f":"IF(J49=0,\"OK\",\" CTRL\")","v":"OK"}]
[null,"Voci di costo a carattere stipendiale",571961.26,408513.54,{"$f":"C50-D50","v":163447.72000000003},0.40010355593109603]
[null,"Straordinario e indennità personale",4630.670000000001,2360.1600000000003,2270.5100000000007,0.96201528709917983]
[null,"Retribuzione per produttività personale",0,0,0,0]
[null,"Altro trattamento accessorio",58248.3,33405.02000000004,24843.279999999962,0.74369900092860097]
[null,"Oneri sociali su retribuzione",177148.29,116580.17,60568.12000000001,0.51954050161361076]
[null,"Altri oneri per il personale",447.14,401.2,45.94,0.11450648055832502]
["BA2220","Costo del personale comparto ruolo sanitario - altro",{"$f":"SUMIF('00 CE'!$B:$B,'Tab 66-67-68-69'!$A56,'00 CE'!G:G)","v":0},{"$f":"SUMIF('00 CE'!$B:$B,'Tab 66-67-68-69'!$A56,'00 CE'!F:F)","v":0},{"$f":"C56-D56","v":0},0]
[]
[]
[null,"Tab. 67 – Costi del personale – ruolo professionale"]
["CODICE MOD. CE","COSTI DEL PERSONALE","Valore CE 2017","Valore CE 2016","Variazioni\nimporto","%"]
[null,null,null,null,null,null,null,"Diff 2015","Ctrl","Diff 2014","Ctrl"]
["BA2230","PERSONALE DEL RUOLO PROFESSIONALE",{"$f":"C63+C79","v":438201.74},{"$f":"D63+D79","v":451377.58999999997},{"$f":"C62-D62","v":-13175.849999999977},{"$f":"IF(AND(C62=0,D62=0),0,IF(C62=0,\"\",IF(D62=0,\"\",E62/D62)))","v":-2.9190306058393324E-2}]
["BA2240","Costo del personale dirigente ruolo professionale",{"$f":"C64+C71+C78","v":425798.17},{"$f":"D64+D71+D78","v":416355.11},{"$f":"C63-D63","v":9443.0599999999977},{"$f":"IF(AND(C63=0,D63=0),0,IF(C63=0,\"\",IF(D63=0,\"\",E63/D63)))","v":2.2680302878953493E-2}]
["BA2250","Costo del personale dirigente ruolo professionale - tempo indeterminato",{"$f":"SUMIF('00 CE'!$B:$B,'Tab 66-67-68-69'!$A64,'00 CE'!G:G)","v":404674.32},{"$f":"SUMIF('00 CE'!$B:$B,'Tab 66-67-68-69'!$A64,'00 CE'!F:F)","v":343146.87},{"$f":"C64-D64","v":61527.450000000012},0.17930354428119952,null,{"$f":"C64-(C65+C66+C67+C68+C69+C70)","v":-2.7715465403161943E-3},{"$f":"IF(H64=0,\"OK\",\" CTRL\")","v":" CTRL"},{"$f":"D64-(D65+D66+D67+D68+D69+D70)","v":0},{"$f":"IF(J64=0,\"OK\",\" CTRL\")","v":"OK"}]
[null,"Voci di costo a carattere stipendiale",159996.66,134372.28,{"$f":"C65-D65","v":25624.380000000005},0.19069692052557272]
[null,"Retribuzione di posizione",98834.01999999999,127207.81000000001,-28373.790000000023,-0.22305069162027097]
[null,"Indennità di risultato",51671.102771546517,0,51671.102771546517,""]
[null,"Altro trattamento accessorio",12186.27,11961.539999999999,224.73000000000138,1.878771462537444E-2]
[null,"Oneri sociali su retribuzione",81986.27,69495.05,12491.220000000001,0.17974258598274268]
[null,"Altri oneri per il personale",0,110.19,-110.19,""]
["BA2260","Costo del personale dirigente ruolo professionale - tempo determinato",{"$f":"SUMIF('00 CE'!$B:$B,'Tab 66-67-68-69'!$A71,'00 CE'!G:G)","v":21123.85},{"$f":"SUMIF('00 CE'!$B:$B,'Tab 66-67-68-69'!$A71,'00 CE'!F:F)","v":73208.239999999991},{"$f":"C71-D71","v":-52084.389999999992},-0.71145529519627848,null,{"$f":"C71-(C72+C73+C74+C75+C76+C77)","v":0},{"$f":"IF(H71=0,\"OK\",\" CTRL\")","v":"OK"},{"$f":"D71-(D72+D73+D74+D75+D76+D77)","v":0},{"$f":"IF(J71=0,\"OK\",\" CTRL\")","v":"OK"}]
[null,"Voci di costo a carattere stipendiale",15694.859999999999,40170.920000000006,{"$f":"C72-D72","v":-24476.060000000005},-0.60929796977515083]
[null,"Retribuzione di posizione",208.70999999999998,17364.869999999992,-17156.159999999993,-0.98798090627801993]
[null,"Indennità di risultato",0,0,0,0]
[null,"Altro trattamento accessorio",578.41999999999996,0,578.41999999999996,""]
[null,"Oneri sociali su retribuzione",4641.8599999999997,15672.45,-11030.59,-0.70382039821470155]
[null,"Altri oneri per il personale",0,0,0,0]
["BA2270","Costo del personale dirigente ruolo professionale - altro",{"$f":"SUMIF('00 CE'!$B:$B,'Tab 66-67-68-69'!$A78,'00 CE'!G:G)","v":0},{"$f":"SUMIF('00 CE'!$B:$B,'Tab 66-67-68-69'!$A78,'00 CE'!F:F)","v":0},{"$f":"C78-D78","v":0},0]
["BA2280","Costo del personale comparto ruolo professionale",{"$f":"C80+C87+C94","v":12403.57},{"$f":"D80+D87+D94","v":35022.480000000003},{"$f":"C79-D79","v":-22618.910000000003},-0.64583975777843261]
["BA2290","Costo del personale comparto ruolo professionale - tempo indeterminato",{"$f":"SUMIF('00 CE'!$B:$B,'Tab 66-67-68-69'!$A80,'00 CE'!G:G)","v":12403.57},{"$f":"SUMIF('00 CE'!$B:$B,'Tab 66-67-68-69'!$A80,'00 CE'!F:F)","v":35022.480000000003},{"$f":"C80-D80","v":-22618.910000000003},-0.64583975777843261,null,{"$f":"C80-(C81+C82+C83+C84+C85+C86)","v":4.6947443570388714E-3},{"$f":"IF(H80=0,\"OK\",\" CTRL\")","v":" CTRL"},{"$f":"D80-(D81+D82+D83+D84+D85+D86)","v":-2.9232648586912546E-2},{"$f":"IF(J80=0,\"OK\",\" CTRL\")","v":" CTRL"}]
[null,"Voci di costo a carattere stipendiale",8038.4100000000017,24114.610000000004,{"$f":"C81-D81","v":-16076.200000000003},-0.66665809648175933]
[null,"Straordinario e indennità personale",0,0,0,0]
[null,"Indennità di risultato",1016.6953052556421,0,1016.6953052556421,""]
[null,"Altro trattamento accessorio",776.98,3614.0292326485842,-2837.0492326485842,-0.78501004004591823]
[null,"Oneri sociali su retribuzione",2571.48,7293.87,-4722.3899999999994,-0.64744641733400776]
[null,"Altri oneri per il personale",0,0,0,0]
["BA2300","Costo del personale comparto ruolo professionale - tempo determinato",{"$f":"SUMIF('00 CE'!$B:$B,'Tab 66-67-68-69'!$A87,'00 CE'!G:G)","v":0},{"$f":"SUMIF('00 CE'!$B:$B,'Tab 66-67-68-69'!$A87,'00 CE'!F:F)","v":0},{"$f":"C87-D87","v":0},0,null,{"$f":"C87-(C88+C89+C90+C91+C92+C93)","v":0},{"$f":"IF(H87=0,\"OK\",\" CTRL\")","v":"OK"},{"$f":"D87-(D88+D89+D90+D91+D92+D93)","v":0},{"$f":"IF(J87=0,\"OK\",\" CTRL\")","v":"OK"}]
[null,"Voci di costo a carattere stipendiale",0,0,{"$f":"C88-D88","v":0},0]
[null,"Straordinario e indennità personale",0,0,0,0]
[null,"Indennità di risultato",0,0,0,0]
[null,"Altro trattamento accessorio",0,0,0,0]
[null,"Oneri sociali su retribuzione",0,0,0,0]
[null,"Altri oneri per il personale",0,0,0,0]
["BA2310","Costo del personale comparto ruolo professionale - altro",{"$f":"SUMIF('00 CE'!$B:$B,'Tab 66-67-68-69'!$A94,'00 CE'!G:G)","v":0},{"$f":"SUMIF('00 CE'!$B:$B,'Tab 66-67-68-69'!$A94,'00 CE'!F:F)","v":0},{"$f":"C94-D94","v":0},0]
[]
[]
[null,"Tab. 68 – Costi del personale – ruolo tecnico"]
["CODICE MOD. CE","COSTI DEL PERSONALE","Valore CE 2017","Valore CE 2016","Variazioni\nimporto","%"]
[null,null,null,null,null,null,null,"Diff 2015","Ctrl","Diff 2014","Ctrl"]
["BA2320","PERSONALE DEL RUOLO TECNICO",{"$f":"C101+C117","v":16516470.15},{"$f":"D101+D117","v":16770524.01},{"$f":"C100-D100","v":-254053.8599999994},{"$f":"IF(AND(C100=0,D100=0),0,IF(C100=0,\"\",IF(D100=0,\"\",E100/D100)))","v":-1.5148832549806498E-2}]
["BA2330","Costo del personale dirigente ruolo tecnico",{"$f":"C102+C109+C116","v":375739.52999999997},{"$f":"D102+D109+D116","v":482150.58999999997},{"$f":"C101-D101","v":-106411.06},{"$f":"IF(AND(C101=0,D101=0),0,IF(C101=0,\"\",IF(D101=0,\"\",E101/D101)))","v":-0.22070088102557336}]
["BA2340","Costo del personale dirigente ruolo tecnico - tempo indeterminato",{"$f":"SUMIF('00 CE'!$B:$B,'Tab 66-67-68-69'!$A102,'00 CE'!G:G)","v":375739.52999999997},{"$f":"SUMIF('00 CE'!$B:$B,'Tab 66-67-68-69'!$A102,'00 CE'!F:F)","v":482150.58999999997},{"$f":"C102-D102","v":-106411.06},-0.22070088102557336,null,{"$f":"C102-(C103+C104+C105+C106+C107+C108)","v":1.5355668729171157E-3},{"$f":"IF(H102=0,\"OK\",\" CTRL\")","v":" CTRL"},{"$f":"D102-(D103+D104+D105+D106+D107+D108)","v":0},{"$f":"IF(J102=0,\"OK\",\" CTRL\")","v":"OK"}]
[null,"Voci di costo a carattere stipendiale",153284.84,219017.24,{"$f":"C103-D103","v":-65732.399999999994},-0.30012431898055147]
[null,"Retribuzione di posizione",81703.89,164655.50999999995,-82951.619999999952,-0.50378891055634867]
[null,"Indennità di risultato",64588.878464433146,0,64588.878464433146,""]
[null,"Altro trattamento accessorio",0,0,0,0]
[null,"Oneri sociali su retribuzione",76161.919999999998,98477.84,-22315.919999999998,-0.22660854462283087]
[null,"Altri oneri per il personale",0,0,0,0]
["BA2350","Costo del personale dirigente ruolo tecnico - tempo determinato",{"$f":"SUMIF('00 CE'!$B:$B,'Tab 66-67-68-69'!$A109,'00 CE'!G:G)","v":0},{"$f":"SUMIF('00 CE'!$B:$B,'Tab 66-67-68-69'!$A109,'00 CE'!F:F)","v":0},{"$f":"C109-D109","v":0},0,null,{"$f":"C109-(C110+C111+C112+C113+C114+C115)","v":0},{"$f":"IF(H109=0,\"OK\",\" CTRL\")","v":"OK"},{"$f":"D109-(D110+D111+D112+D113+D114+D115)","v":0},{"$f":"IF(J109=0,\"OK\",\" CTRL\")","v":"OK"}]
[null,"Voci di costo a carattere stipendiale",0,0,{"$f":"C110-D110","v":0},0]
[null,"Retribuzione di posizione",0,0,0,0]
[null,"Indennità di risultato",0,0,0,0]
[null,"Altro trattamento accessorio",0,0,0,0]
[null,"Oneri sociali su retribuzione",0,0,0,0]
[null,"Altri oneri per il personale",0,0,0,0]
["BA2360","Costo del personale dirigente ruolo tecnico - altro",{"$f":"SUMIF('00 CE'!$B:$B,'Tab 66-67-68-69'!$A116,'00 CE'!G:G)","v":0},{"$f":"SUMIF('00 CE'!$B:$B,'Tab 66-67-68-69'!$A116,'00 CE'!F:F)","v":0},{"$f":"C116-D116","v":0},0]
["BA2370","Costo del personale comparto ruolo tecnico",{"$f":"C118+C125+C132","v":16140730.620000001},{"$f":"D118+D125+D132","v":16288373.42},{"$f":"C117-D117","v":-147642.79999999888},-9.064305943447537E-3]
["BA2380","Costo del personale comparto ruolo tecnico - tempo indeterminato",{"$f":"SUMIF('00 CE'!$B:$B,'Tab 66-67-68-69'!$A118,'00 CE'!G:G)","v":15963506.970000001},{"$f":"SUMIF('00 CE'!$B:$B,'Tab 66-67-68-69'!$A118,'00 CE'!F:F)","v":15879905.449999999},{"$f":"C118-D118","v":83601.520000001416},5.2646106907394347E-3,null,{"$f":"C118-(C119+C120+C121+C122+C123+C124)","v":0},{"$f":"IF(H118=0,\"OK\",\" CTRL\")","v":"OK"},{"$f":"D118-(D119+D120+D121+D122+D123+D124)","v":0},{"$f":"IF(J118=0,\"OK\",\" CTRL\")","v":"OK"}]
[null,"Voci di costo a carattere stipendiale",10965254.684545454,10745537.57,{"$f":"C119-D119","v":219717.11454545334},2.0447289222539411E-2]
[null,"Straordinario",276416.17,243774.23,32641.939999999973,0.13390234070270665]
[null,"Indennità di risultato",550517.45545454731,694095.82999999786,-143578.37454545056,-0.20685670240296788]
[null,"Altro trattamento accessorio",708502.31,749489.7300000001,-40987.420000000042,-5.4687100248858693E-2]
[null,"Oneri sociali su retribuzione",3326919.6,3295584.7,31334.899999999907,9.5081458534504986E-3]
[null,"Altri oneri per il personale",135896.75,151423.38999999998,-15526.639999999985,-0.10253792363253779]
["BA2390","Costo del personale comparto ruolo tecnico - tempo determinato",{"$f":"SUMIF('00 CE'!$B:$B,'Tab 66-67-68-69'!$A125,'00 CE'!G:G)","v":177223.65000000002},{"$f":"SUMIF('00 CE'!$B:$B,'Tab 66-67-68-69'!$A125,'00 CE'!F:F)","v":408467.97},{"$f":"C125-D125","v":-231244.31999999995},-0.56612595597152937,null,{"$f":"C125-(C126+C127+C128+C129+C130+C131)","v":0},{"$f":"IF(H125=0,\"OK\",\" CTRL\")","v":"OK"},{"$f":"D125-(D126+D127+D128+D129+D130+D131)","v":0},{"$f":"IF(J125=0,\"OK\",\" CTRL\")","v":"OK"}]
[null,"Voci di costo a carattere stipendiale",133711.14000000001,256263.82000000004,{"$f":"C126-D126","v":-122552.68000000002},-0.47822856929238006]
[null,"Straordinario",3035.49,5602.8499999999995,-2567.3599999999997,-0.45822393960216673]
[null,"Indennità di risultato",0,0,0,0]
[null,"Altro trattamento accessorio",1502.16,11609.929999999944,-10107.769999999944,-0.87061420697626879]
[null,"Oneri sociali su retribuzione",38974.86,134991.37,-96016.51,-0.71127887656818356]
[null,"Altri oneri per il personale",0,0,0,0]
["BA2400","Costo del personale comparto ruolo tecnico - altro",{"$f":"SUMIF('00 CE'!$B:$B,'Tab 66-67-68-69'!$A132,'00 CE'!G:G)","v":0},{"$f":"SUMIF('00 CE'!$B:$B,'Tab 66-67-68-69'!$A132,'00 CE'!F:F)","v":0},{"$f":"C132-D132","v":0},0]
[]
[]
[null,"Tab. 69 – Costi del personale – ruolo amministrativo"]
["CODICE MOD. CE","COSTI DEL PERSONALE","Valore CE 2017","Valore CE 2016","Variazioni\nimporto","%"]
[null,null,null,null,null,null,null,"Diff 2015","Ctrl","Diff 2014","Ctrl"]
["BA2410","PERSONALE DEL RUOLO AMMINISTRATIVO",{"$f":"C139+C155","v":10114311.859999999},{"$f":"D139+D155","v":10174243.659999998},{"$f":"C138-D138","v":-59931.799999998882},{"$f":"IF(AND(C138=0,D138=0),0,IF(C138=0,\"\",IF(D138=0,\"\",E138/D138)))","v":-5.8905410566900945E-3}]
["BA2420","Costo del personale dirigente ruolo amministrativo",{"$f":"C140+C147+C154","v":824224.55},{"$f":"D140+D147+D154","v":787868.7},{"$f":"C139-D139","v":36355.850000000093},{"$f":"IF(AND(C139=0,D139=0),0,IF(C139=0,\"\",IF(D139=0,\"\",E139/D139)))","v":4.6144554289312543E-2}]
["BA2430","Costo del personale dirigente ruolo amministrativo - tempo indeterminato",{"$f":"SUMIF('00 CE'!$B:$B,'Tab 66-67-68-69'!$A140,'00 CE'!G:G)","v":824224.55},{"$f":"SUMIF('00 CE'!$B:$B,'Tab 66-67-68-69'!$A140,'00 CE'!F:F)","v":787868.7},{"$f":"C140-D140","v":36355.850000000093},4.6144554289312543E-2,null,{"$f":"C140-(C141+C142+C143+C144+C145+C146)","v":-4.1573198977857828E-3},{"$f":"IF(H140=0,\"OK\",\" CTRL\")","v":" CTRL"},{"$f":"D140-(D141+D142+D143+D144+D145+D146)","v":0},{"$f":"IF(J140=0,\"OK\",\" CTRL\")","v":"OK"}]
[null,"Voci di costo a carattere stipendiale",244742.47000000006,262880.41000000003,{"$f":"C141-D141","v":-18137.939999999973},-6.8996925255860528E-2]
[null,"Retribuzione di posizione",226009.87000000002,244843.43999999994,-18833.56999999992,-7.6920868290365152E-2]
[null,"Indennità di risultato",77506.65415731979,0,77506.65415731979,""]
[null,"Altro trattamento accessorio",97520.77,108305.73,-10784.959999999992,-9.9578849613958492E-2]
[null,"Oneri sociali su retribuzione",178444.79,171839.12,6605.6700000000128,3.8441013897184836E-2]
[null,"Altri oneri per il personale",0,0,0,0]
["BA2440","Costo del personale dirigente ruolo amministrativo - tempo determinato",{"$f":"SUMIF('00 CE'!$B:$B,'Tab 66-67-68-69'!$A147,'00 CE'!G:G)","v":0},{"$f":"SUMIF('00 CE'!$B:$B,'Tab 66-67-68-69'!$A147,'00 CE'!F:F)","v":0},{"$f":"C147-D147","v":0},0,null,{"$f":"C147-(C148+C149+C150+C151+C152+C153)","v":0},{"$f":"IF(H147=0,\"OK\",\" CTRL\")","v":"OK"},{"$f":"D147-(D148+D149+D150+D151+D152+D153)","v":0},{"$f":"IF(J147=0,\"OK\",\" CTRL\")","v":"OK"}]
[null,"Voci di costo a carattere stipendiale",0,0,{"$f":"C148-D148","v":0},0]
[null,"Retribuzione di posizione",0,0,0,0]
[null,"Indennità di risultato",0,0,0,0]
[null,"Altro trattamento accessorio",0,0,0,0]
[null,"Oneri sociali su retribuzione",0,0,0,0]
[null,"Altri oneri per il personale",0,0,0,0]
["BA2450","Costo del personale dirigente ruolo amministrativo - altro",{"$f":"SUMIF('00 CE'!$B:$B,'Tab 66-67-68-69'!$A154,'00 CE'!G:G)","v":0},{"$f":"SUMIF('00 CE'!$B:$B,'Tab 66-67-68-69'!$A154,'00 CE'!F:F)","v":0},{"$f":"C154-D154","v":0},0]
["BA2460","Costo del personale comparto ruolo amministrativo",{"$f":"C156+C163+C170","v":9290087.3099999987},{"$f":"D156+D163+D170","v":9386374.959999999},{"$f":"C155-D155","v":-96287.650000000373},-1.0258236050693674E-2]
["BA2470","Costo del personale comparto ruolo amministrativo - tempo indeterminato",{"$f":"SUMIF('00 CE'!$B:$B,'Tab 66-67-68-69'!$A156,'00 CE'!G:G)","v":9288718.9999999981},{"$f":"SUMIF('00 CE'!$B:$B,'Tab 66-67-68-69'!$A156,'00 CE'!F:F)","v":9385507.379999999},{"$f":"C156-D156","v":-96788.38000000082},-1.0312535708644963E-2,null,{"$f":"C156-(C157+C158+C159+C160+C161+C162)","v":4.3078754097223282E-3},{"$f":"IF(H156=0,\"OK\",\" CTRL\")","v":" CTRL"},{"$f":"D156-(D157+D158+D159+D160+D161+D162)","v":0},{"$f":"IF(J156=0,\"OK\",\" CTRL\")","v":"OK"}]
[null,"Voci di costo a carattere stipendiale",6616939.125454546,6652614.4800000014,{"$f":"C157-D157","v":-35675.354545455426},-5.3626066342349387E-3]
[null,"Straordinario",86745.58,85135.44,1610.1399999999994,1.8912687830121032E-2]
[null,"Indennità di risultato",349555.88023757591,18010.510000000002,331545.3702375759,18.408438752571463]
[null,"Altro trattamento accessorio",230889.74,607405.31000000006,-376515.57000000007,-0.61987533497196468]
[null,"Oneri sociali su retribuzione",1952572.67,1969483.03,-16910.360000000102,-8.5861922862062456E-3]
[null,"Altri oneri per il personale",52016,52858.609999999993,-842.60999999999331,-1.5940827804590271E-2]
["BA2480","Costo del personale comparto ruolo amministrativo - tempo determinato",{"$f":"SUMIF('00 CE'!$B:$B,'Tab 66-67-68-69'!$A163,'00 CE'!G:G)","v":1368.31},{"$f":"SUMIF('00 CE'!$B:$B,'Tab 66-67-68-69'!$A163,'00 CE'!F:F)","v":867.58},{"$f":"C163-D163","v":500.7299999999999},0.57715714977293142,null,{"$f":"C163-(C164+C165+C166+C167+C168+C169)","v":0},{"$f":"IF(H163=0,\"OK\",\" CTRL\")","v":"OK"},{"$f":"D163-(D164+D165+D166+D167+D168+D169)","v":0},{"$f":"IF(J163=0,\"OK\",\" CTRL\")","v":"OK"}]
[null,"Voci di costo a carattere stipendiale",0,867.58,{"$f":"C164-D164","v":-867.58},""]
[null,"Straordinario",0,0,0,0]
[null,"Indennità di risultato",0,0,0,0]
[null,"Altro trattamento accessorio",0,0,0,0]
[null,"Oneri sociali su retribuzione",0,0,0,0]
[null,"Altri oneri per il personale",1368.31,0,1368.31,""]
["BA2490","Costo del personale comparto ruolo amministrativo - altro",{"$f":"SUMIF('00 CE'!$B:$B,'Tab 66-67-68-69'!$A170,'00 CE'!G:G)","v":0},{"$f":"SUMIF('00 CE'!$B:$B,'Tab 66-67-68-69'!$A170,'00 CE'!F:F)","v":0},{"$f":"C170-D170","v":0},0]
[]
[]
[]
["CP01 - Costi del personale"]
["CP01 - SI","Il costo del personale per l'anno 2017 si attesta ad €/000 165.244."]

{"sheet":"Personale in Comando","index":27,"n_rows":39,"n_cols":5,"rows_kept":39,"cut":false,"hidden":false,"merged":[[0,0,0,4],[2,0,2,3]]}
["Dati sull'occupazione al 31.12.2017"]
[]
["PERSONALE DIPENDENTE (*) (Conto Annuale)"]
[null,"T1A","T1C","T1A","T1C"]
["Tipologia di personale","Personale in comando al 31/12/2016 ad altri enti","Personale in comando al 31/12/2016 da altri enti","Personale in comando al 31/12/2017 ad altri enti","Personale in comando al 31/12/2017 da altri enti"]
["RUOLO SANITARIO"]
["Dirigenza"]
["- Medico veterinaria",null,1]
["- Sanitaria"]
["Comparto"]
["- Categoria Ds"]
["- Categoria D",1,10,1,5]
["- Categoria C"]
["- Categoria Bs"]
["RUOLO PROFESSIONALE"]
["Dirigenza"]
["Livello dirigenziale"]
["Comparto"]
["- Categoria D"]
["RUOLO TECNICO"]
["Dirigenza"]
["Livello dirigenziale"]
["Comparto"]
["- Categoria Ds"]
["- Categoria D"]
["- Categoria C"]
["- Categoria Bs",null,1,null,2]
["- Categoria B"]
["- Categoria A"]
["RUOLO AMMINISTRATIVO"]
["Dirigenza"]
["Livello dirigenziale"]
["Comparto"]
["- Categoria Ds",null,null,null,1]
["- Categoria D",null,null,1]
["- Categoria C"]
["- Categoria Bs"]
["- Categoria B"]
["- Categoria A"]

{"sheet":"Personale Universitario","index":28,"n_rows":17,"n_cols":5,"rows_kept":17,"cut":false,"hidden":false,"merged":[[0,0,0,4],[2,0,2,3]]}
["Dati sull'occupazione al 31.12.2017"]
[]
["PERSONALE UNIVERSITARIO (Conto Annuale T1B)"]
[]
["Tipologia di personale","Personale al 31/12/2016","di cui a tempo parziale al 31/12/2016","Personale al 31/12/2017","di cui a tempo parziale al 31/12/2017"]
["RUOLO SANITARIO"]
["Dirigenza",10,0,12,0]
["Comparto"]
["RUOLO PROFESSIONALE"]
["Dirigenza"]
["Comparto"]
["RUOLO TECNICO"]
["Dirigenza"]
["Comparto"]
["RUOLO AMMINISTRATIVO"]
["Dirigenza"]
["Comparto"]

{"sheet":"Altro Contratto","index":29,"n_rows":58,"n_cols":3,"rows_kept":58,"cut":false,"hidden":false,"merged":[[50,0,50,2],[0,0,0,2],[2,0,2,2],[18,0,18,2],[34,0,34,2]]}
["Dati sull'occupazione al 31.12.2017"]
[]
["PERSONALE CON ALTRO CONTRATTO - FORMAZIONE LAVORO (Conto Annuale T2)"]
[]
["Tipologia di personale","Uomini/Anno al 31/12/2016","Uomini/Anno al 31/12/2017"]
["RUOLO SANITARIO"]
["Dirigenza"]
["Comparto"]
["RUOLO PROFESSIONALE"]
["Dirigenza"]
["Comparto"]
["RUOLO TECNICO"]
["Dirigenza"]
["Comparto"]
["RUOLO AMMINISTRATIVO"]
["Dirigenza"]
["Comparto"]
[]
["PERSONALE CON ALTRO CONTRATTO - CONTRATTO DI SOMMINISTRAZIONE (Conto Annuale T2)"]
[]
["Tipologia di personale","Uomini/Anno al 31/12/2016","Uomini/Anno al 31/12/2017"]
["RUOLO SANITARIO"]
["Dirigenza"]
["Comparto",10,42]
["RUOLO PROFESSIONALE"]
["Dirigenza"]
["Comparto"]
["RUOLO TECNICO"]
["Dirigenza"]
["Comparto",28,{"$f":"25+3+20","v":48}]
["RUOLO AMMINISTRATIVO"]
["Dirigenza"]
["Comparto"]
[]
["PERSONALE CON ALTRO CONTRATTO - CONTRATTO LSU (Conto Annuale T2)"]
[]
["Tipologia di personale","Uomini/Anno al 31/12/2016","Uomini/Anno al 31/12/2017"]
["RUOLO SANITARIO"]
["Dirigenza"]
["Comparto"]
["RUOLO PROFESSIONALE"]
["Dirigenza"]
["Comparto"]
["RUOLO TECNICO"]
["Dirigenza"]
["Comparto"]
["RUOLO AMMINISTRATIVO"]
["Dirigenza"]
["Comparto"]
[]
["PERSONALE IN CONVENZIONE  (FLS 12 quadro E per MMG e PLS)"]
[]
["Tipologia di personale","Uomini/Anno al 31/12/2016","Uomini/Anno al 31/12/2017"]
["MEDICINA DI BASE"]
["MMG"]
["PLS"]
["Continuità assistenziale"]
["Altro"]

{"sheet":"Personale - Conto annuale","index":30,"n_rows":41,"n_cols":9,"rows_kept":41,"cut":false,"hidden":false,"merged":[[0,1,0,8],[2,1,2,4],[3,1,3,5],[40,1,40,8]]}
[null,"Dati sull'occupazione al 31.12.2017"]
[]
[null,"PERSONALE DIPENDENTE (*) (Conto Annuale)"]
[null,"T1",null,null,null,null,"T12","T12","T13"]
[null,"Tipologia di personale","Personale al 31/12/2016","di cui Personale Part Time","Personale al 31/12/2017","di cui Personale Part Time","Numero Mensilità","Totale spese a carattere stipendiale","Totale spese accessorie"]
[null,"RUOLO SANITARIO",2371,39,2333,40,41634,77923194.489997864,30343290.64691272]
[null,"Dirigenza",729,3,710,3,12592,34321617.211816892,22570239.626896042]
["01DIME","- Medico veterinaria",666,3,646,3,11710,31400448.711816881,21336271.861502744]
["01S","- Sanitaria",63,0,64,0,882,2921168.500000013,1233967.7653932972]
[null,"Comparto",1642,36,1623,37,29042,43601577.278180979,7773051.0200166777]
["01COMPDS","- Categoria Ds",43,0,40,0,812,1210077.9300000037,222135.11225254781]
["01COMPD","- Categoria D",1541,36,1532,37,27348,41053699.708180964,7289297.372892132]
["01COMPC","- Categoria C",58,0,51,0,882,1337799.640000006,261618.5348719985]
[null,"- Categoria Bs",0,0,0,0,0,0,0]
[null,"RUOLO PROFESSIONALE",5,0,4,0,29,193588.85,149449.298702664]
[null,"Dirigenza",4,0,4,0,24,185536.43,148617.078702664]
["02PTA","Livello dirigenziale",4,0,4,0,24,185536.43,148617.078702664]
[null,"Comparto",1,0,0,0,5,8052.4200000000019,832.21999999999991]
["02COMPD","- Categoria D",1,0,0,0,5,8052.4200000000019,832.21999999999991]
[null,"RUOLO TECNICO",533,6,531,5,6343,11300266.914545557,1771400.2691548248]
[null,"Dirigenza",5,0,3,0,31,160597.46,109507.559026998]
["03PTA","Livello dirigenziale",5,0,3,0,31,160597.46,109507.559026998]
[null,"Comparto",528,6,528,5,6312,11139669.454545556,1661892.7101278268]
["03COMPDS","- Categoria Ds",5,0,5,0,50,148058.32999999993,15751.710281568468]
["03COMPD","- Categoria D",38,0,38,0,495,1075919.9800000016,80884.068139920346]
["03COMPC","- Categoria C",10,0,9,0,137,239083.59999999989,29057.57850682324]
["03COMPBS","- Categoria Bs",238,3,250,2,3003,5079794.1700000381,917227.34819105151]
["03COMPB","- Categoria B",163,3,155,3,1699,3233478.4445455079,420990.07695387723]
["03COMPA","- Categoria A",74,0,71,0,928,1363334.9300000088,197981.92805458597]
[null,"RUOLO AMMINISTRATIVO",291,2,282,2,3336,6922703.1754545867,1074800.1349479074]
[null,"Dirigenza",6,0,8,0,55,272895.04999999987,389092.35740532796]
["04PTA","Livello dirigenziale",6,0,8,0,55,272895.04999999987,389092.35740532796]
[null,"Comparto",285,2,274,2,3281,6649808.1254545869,685707.77754257945]
["04COMPDS","- Categoria Ds",22,0,23,0,270,640827.0900000016,128404.10729521501]
["04COMPD","- Categoria D",70,1,65,1,890,1813806.6654545462,203353.74571670379]
["04COMPC","- Categoria C",67,0,63,0,844,1644297.4200000081,140663.24160407635]
["04COMPBS","- Categoria Bs",0,0,0,0,0,0,0]
["04COMPB","- Categoria B",104,1,102,1,1039,2125603.5100000324,176339.6397439967]
["04COMPA","- Categoria A",22,0,21,0,238,425273.43999999895,36947.043182587564]
[]
[null,"(+) E' necessario comprendere anche il personale dipendente del comparto a tempo determinato che però è rilevato nella Tabella 2 del conto annuale con diverso criterio (uomini - anno)"]

{"sheet":"Tabella 2 Consuntivo","index":31,"n_rows":26,"n_cols":14,"rows_kept":26,"cut":false,"hidden":false,"merged":[[0,3,0,13],[1,3,1,13]]}
[null,null,null,"Tabella 2"]
[null,null,null,"Consuntivo Esercizio 2017 "]
[]
[null,null,null,"Denominazione regione","Abruzzo"]
[null,null,null,"Denominazione azienda/ente","AUSL PE"]
[null,null,null,"Periodo di rilevazione",2017]
[null,null,null,null,"Totali presenti al 31/12/17","Spesa per comp. fisse                 (2)","Spesa per comp. accessorie     (3)","Totale fisse +  accessorie (4) = (2) + (3)","IRAP (5)","Spese per contributi a carico dell'AUSL    (6)","Altre voci  di spesa         (7)","Totale                  (8)=(4)+(5)+(6)+(7)","di cui per rinnovi contrattuali post anno 2004 (9)","Totale al netto dei rinnovi      (10) = (8) + (9)"]
[null,null,null,null,null,"FI","AC",null,"IR","ON","AL"]
[null,null,null,"Personale dipendente Tempo Indeterm.",{"$f":"E10+E11+E12+E14","v":2900},{"$f":"F10+F11+F12+F14","v":88567450.870000005},33701340.972226351,122268791.84222636,10072362.4299,33908649.475449875,689230.72,166939034.46757621,-25880996.718632337,{"$f":"L9+M9","v":141058037.74894387}]
["TI","CEM01","N","- Medici",616,28567267.670000002,22311352.772226352,{"$f":"F10+G10","v":50878620.44222635},4184042.7911892398,14995739.965449871,39463.679999999993,{"$f":"H10+I10+J10+K10","v":70097866.878865466},-12355983.366851099,57741883.512014367]
["TI","CEM02","N","- Dirigenti non medici",76,3322378.58,1967469.83,{"$f":"F11+G11","v":5289848.41},436115.41000000003,1389946.01,10904.27,{"$f":"H11+I11+J11+K11","v":7126814.0999999996},-1217349.6721393028,5909464.4278606968]
["TI","CEM03","N","- Personale non dirigente",2207,56644704.689999998,9421999.459999999,{"$f":"F12+G12","v":66066704.149999999},5449346.6687107608,17512199.280000001,638862.77,{"$f":"H12+I12+J12+K12","v":89667112.868710756},-12301182.869823128,77365929.998887628]
["TI",null,"S","(categorie protette NON comprese) ",172,3539886.5399999996,327780.3,{"$f":"F13+G13","v":3867666.8399999994},329027.26999999996,1036080.3999999999,33509.799999999996,{"$f":"H13+I13+J13+K13","v":5266284.3099999996},-722466.9588352032,4543817.3511647964]
["TI","CEM04","N","- Personale contrattista",1,33099.93,518.91,{"$f":"F14+G14","v":33618.840000000004},2857.56,10764.22,0,{"$f":"H14+I14+J14+K14","v":47240.62},-6480.8098188093209,40759.810181190682]
[]
["TD",null,null,"Personale a Tempo Determinato",62,1729640.03,593894.0199999999,{"$f":"F16+G16","v":2323534.0499999998},196869.11000000002,692597.92999999993,2223.46,{"$f":"H16+I16+J16+K16","v":3215224.55},-529231.39364326792,{"$f":"L16+M16","v":2685993.1563567319}]
[]
[null,null,null,"Restante personale",93,2872943.7499999995,0,{"$f":"F18+G18","v":2872943.7499999995},0,0,0,{"$f":"H18+I18+J18+K18","v":2872943.7499999995},0,{"$f":"L18+M18","v":2872943.7499999995}]
[]
[null,null,null,"Totale  ",{"$f":"E9+E16+E18","v":3055},{"$f":"F9+F16+F18","v":93170034.650000006},{"$f":"G9+G16+G18","v":34295234.992226355},{"$f":"F20+G20","v":127465269.64222637},{"$f":"I9+I16+I18","v":10269231.539899999},{"$f":"J9+J16+J18","v":34601247.405449875},{"$f":"K9+K16+K18","v":691454.17999999993},{"$f":"H20+I20+J20+K20","v":173027202.76757625},{"$f":"M9+M16+M18","v":-26410228.112275604},{"$f":"N9+N16+N18","v":146616974.65530059}]
[]
[]
[null,null,null,"Indennità De Maria",12,null,null,null,null,null,null,242210.34,0,242210.34]
[null,null,null,"Medicina Penitenziaria",16,433836.44,113107.75,{"$f":"F24+G24","v":546944.18999999994},46490.110000000008,150790.01999999999,1515.18,{"$f":"H24+I24+J24+K24","v":745739.5},-112889.56911653106,{"$f":"L24+M24","v":632849.93088346894}]
[]
[null,null,null,null,null,null,null,null,null,null,null,{"$f":"L20+L23","v":173269413.10757625},"Totale",{"$f":"N20+N23","v":146859184.99530059}]

{"sheet":"Riconciliazione Tabella 2 vs CE","index":32,"n_rows":18,"n_cols":3,"rows_kept":18,"cut":false,"hidden":false,"merged":[]}
[]
[null,"Riconciliazione Tabella 2 e CE consuntivo 2017"]
[]
[null,"Spesa del personale indicata nel totale della tabella 2 come da Piano di Rientro",173269413.10757625]
[null,"Costi presenti in Tabella 2 e non presenti nel CE"]
["*","Restante Personale (COCOCO, Locatio Operis, Barellieri)",-2872943.7499999995]
["**","Indennità De Maria",-242210.34]
["***","Personale Religioso",-47362.36]
[null,"Trattenuta a dipendenti - Mensa aziendale",-240333.49]
[null,"Costi presenti nel CE e non presenti in Tabella 2"]
[null,"Categorie Protette da Tabella 2",5266284.3099999996]
[null,"Medicina Penitenziaria da Tabella 2",745739.5]
[null,"totale",{"$f":"C4+C6+C7+C8+C9+C11+C12","v":175878586.97757623}]
[null,"Costo complesivo del personale da CE (Voce BA0280 + YA0020)",175878586.96000001]
[]
["*","Conti CO.GE. 0702011509, 0702011511 e 0702020215"]
["**","Conto CO.GE. 0702011510"]
["***","Conto CO.GE. 0702011518"]

{"sheet":"Fondi CCNL - Consistenza","index":33,"n_rows":19,"n_cols":10,"rows_kept":19,"cut":false,"hidden":false,"merged":[[0,0,0,9],[18,0,18,9]]}
["Consistenza e movimentazione dei fondi del personale "]
[null,"IMPORTO FONDO  AL 31/12/2010","IMPORTO FONDO  AL 01/01/2017","PERSONALE PRESENTE AL 01/01/2017","PERSONALE ASSUNTO NELL'ANNO 2017","PERSONALE CESSATO NELL'ANNO 2017","PERSONALE PRESENTE AL 31/12/2017","IMPORTO FONDO  AL 31/12/2017","VARIAZIONE FONDO ANNO 2017 VS FONDO ANNO 2010","VARIAZIONE FONDO ANNO 2017 VS FONDO INZIALE ANNO 2017"]
[null,"(1)","(2)","(3)","(4)","(5)","(6)=(3)+(4)-(5)","(7)","(8)=(7)-(1)","(9)=(7)-(2)"]
["MEDICI E VETERINARI"]
["- Fondo specificità medica, retribuzione di posizione, equiparazione, specifico trattamento",11626812,12036389.892927034,666,18,38,646,11695817.21338187,69005.213381869718,-340572.67954516411]
["- Fondo trattamento accessorio condizioni di lavoro",2596715,2596715.3173840092,666,18,38,646,2594805.9678859329,-1909.0321140671149,-1909.3494980763644]
["-Fondo retribuzione di risultato e qualità prestazioni individuale",339252,339251.68,666,18,38,646,339002.23023529409,-249.76976470591035,-249.44976470590336]
["DIRIGENTI  NON MEDICI SPTA"]
["- Fondo specificità medica, retribuzione di posizione, equiparazione, specifico trattamento",1330689,1153782.4878142446,78,6,5,79,1150223.4733498401,-180465.52665015985,-3559.014464404434]
["- Fondo trattamento accessorio condizioni di lavoro",74746,71826.286871708289,78,6,5,79,71265.144005523078,-3480.8559944769222,-561.14286618521146]
["-Fondo retribuzione di risultato e qualità prestazioni individuale",93699,87567.076709710353,78,6,5,79,86992.043172926351,-6706.956827073649,-575.03353678400163]
["PERSONALE NON DIRIGENTE"]
["- Fondo fasce, posizioni organizzative, ex indennità di qualificazione professionale e indennità professionale specifica",8864277,9035683.390864281,2456,56,87,2425,8691009.5141174458,-173267.4858825542,-344673.87674683519]
["- Fondo lavoro straordinario e remunerazione di particolari condizioni di disagio pericolo o danno",6037257,5945174.9837377304,2456,56,87,2425,5872687.1078298166,-164569.89217018336,-72487.875907913782]
["-Fondo della produttività collettiva per il  miglioramento dei servizi e premio della qualità delle prestazioni individuali",1523723,1500482.5448211136,2456,56,87,2425,1482187.5757397155,-41535.424260284519,-18294.9690813981]
["TOTALE",32487170,32766873.661129832,3200,80,{"$f":"+F15+F7+F9","v":130},{"$f":"+G15+G7+G9","v":3150},31983990.26971836,-503179.73028163583,-782883.39141146711]
[]
[]
["Si precisa che la determinazione dei fondi è stata effettuata in conformità alle disposizioni di cui all’art.23 comma 2 del D. Lgs. n. 75/2017 e che pertanto le dinamiche del personale rilevate nell'anno 2017 ed indicate nella suddetta tabella non costituiscono ai sensi della predetta norma riferimento esclusivo ai fini della riduzione operata sui fondi contrattuali."]

{"sheet":"Fondi CCNL - Serie Storica","index":34,"n_rows":29,"n_cols":5,"rows_kept":29,"cut":false,"hidden":false,"merged":[[17,0,17,1],[18,0,18,1],[26,0,26,5],[27,0,27,5],[28,0,28,5],[19,0,19,1],[21,0,21,1],[22,0,22,1],[23,0,23,1],[25,0,25,5],[20,0,20,1],[12,0,12,1],[16,0,16,1],[8,0,8,1],[0,0,0,4],[2,0,2,4],[3,0,3,1],[5,0,5,1],[6,0,6,1],[7,0,7,1],[9,0,9,1],[10,0,10,1],[11,0,11,1],[13,0,13,1],[14,0,14,1],[15,0,15,1]]}
[" Serie storica dei fondi del personale "]
[]
["Dettaglio PERSONALE"]
["FONDI",null,2015,2016,2017]
["AREA DIRIGENZA MEDICO - VETERINARIA"]
["FONDO PER LA RETRIBUZIONE DI RISULTATO E PER LA QUALITA' DELLA PRESTAZIONE INDIVIDUALE ",null,339251.68,339002.23023529409,339002.23023529409]
["FONDO PER IL TRATTAMENTO ACCESSORIO LEGATO ALLE CONDIZIONI DI LAVORO",null,2596715,2594805.9678859329,2594805.9678859329]
["FONDO PER L'INDENNITA' DI SPECIFICITA' MEDICA, RETRIBUZIONE DI POSIZIONE, EQUIPARAZIONE, SPECIFICO TRATTAMENTO E INDENNITA' DI DIREZIONE DI STRUTTURA COMPLESSA",null,11704423.407063534,11695817.21338187,11695817.21338187]
["AREA DIRIGENZA SANITARIA NON MEDICA"]
["FONDO PER LA RETRIBUZIONE DI RISULTATO E PER LA QUALITÀ DELLA PRESTAZIONE INDIVIDUALE",null,73604.292708354755,73604.292708354755,73604.292708354755]
["FONDO PER IL TRATTAMENTO ACCESSORIO LEGATO ALLE CONDIZIONI DI LAVORO",null,70704.001139337852,70704.001139337852,70704.001139337852]
["FONDO PER LA RETRIBUZIONE DI POSIZIONE, EQUIPARAZIONE, SPECIFICO TRATTAMENTO E INDENNITA' DI DIREZIONE DI STRUTTURA COMPLESSA",null,489648.04488432815,485190.40488432813,485190.40488432813]
["AREA DIRIGENZA PROFESSIONI SANITARIE"]
["FONDO PER LA RETRIBUZIONE DI RISULTATO E PER LA QUALITÀ DELLA PRESTAZIONE INDIVIDUALE",null,1150.0670735680389,575.03353678401947,575.03353678401947]
["FONDO PER IL TRATTAMENTO ACCESSORIO LEGATO ALLE CONDIZIONI DI LAVORO",null,1122.2857323704393,561.14286618521965,561.14286618521965]
["FONDO PER LA RETRIBUZIONE DI POSIZIONE, EQUIPARAZIONE, SPECIFICO TRATTAMENTO E INDENNITA' DI DIREZIONE DI STRUTTURA COMPLESSA",null,4590.05,6862.2100000000009,6862.2100000000009]
["AREA DIRIGENZA PROFESSIONALE TECNICA ED AMMINISTRATIVA (P.T.A.)"]
["FONDO PER LA RETRIBUZIONE DI RISULTATO E PER LA QUALITÀ DELLA PRESTAZIONE INDIVIDUALE",null,12812.716927787573,12812.716927787573,12812.716927787573]
["FONDO PER IL TRATTAMENTO ACCESSORIO LEGATO ALLE CONDIZIONI DI LAVORO",null,null,0]
["FONDO PER LA RETRIBUZIONE DI POSIZIONE, EQUIPARAZIONE, SPECIFICO TRATTAMENTO E INDENNITA' DI DIREZIONE DI STRUTTURA COMPLESSA",null,658170.85846551193,658170.85846551193,658170.85846551193]
["AREA COMPARTO"]
["FONDO DELLA PRODUTTIVITA' COLLETTIVA",null,1500482.5448211136,1482187.5757397155,1482187.5757397155]
["FONDO PER I COMPENSI DI LAVORO STRAORDINARIO ETC.",null,5945174.9837377304,5872687.1078298166,5872687.1078298166]
["FONDO PER IL FINANZIAMENTO FASCE RETRIBUTIVE, POSIZIONI ORGANIZZATIVE, VALORE COMUNE DELLE EX INDENNITA' DI QUALIFICAZIONE PROFESSIONALE E INDENNITA' PROFESSIONALE SPECIFICA",null,8798284.5668499339,8691009.5141174458,8691009.5141174477]
[]
["I riferimenti dei provvedimenti adottati dall'azienda in ordine alla costituzione dei Fondi Contrattuali sono i seguenti: "]
["Deliberazione DG N. 299 del 26/03/2018: Adozione Fondi Contrattuali area Dirigenza consuntivi anno 2017 e preventivi anno 2018"]
["Deliberazione DG  N. 300 del 26/03/2018: Adozione Fondi Contrattuali aree Comparto consuntivi anno 2017 e preventivi anno 2018"]
["I provvedimenti sopra elencati sono allegati al presente bilancio."]

{"sheet":"Tab 71","index":35,"n_rows":22,"n_cols":6,"rows_kept":22,"cut":false,"hidden":false,"merged":[[20,0,20,1],[20,2,20,3],[21,0,21,1],[20,4,20,9],[21,4,21,9],[0,0,0,5],[3,0,4,0],[3,1,4,1],[3,2,4,2],[3,3,4,3],[3,4,4,4],[2,1,2,5],[3,5,4,5]]}
["22.     Oneri diversi di gestione"]
[]
[null,"Tab. 71 – Dettaglio oneri diversi di gestione"]
["CODICE MOD. CE","DETTAGLIO ONERI DIVERSI DI GESTIONE",{"$f":"\"Valore CE \" &'00 Aggregatore'!$F$2","v":"Valore CE 2017"},{"$f":"\"Valore CE \" &'00 Aggregatore'!$F$2-1","v":"Valore CE 2016"},"Variazioni\nimporto","%"]
[]
["BA2510","Imposte e tasse (escluso IRAP e IRES)",{"$f":"SUMIF('00 CE'!$B:$B,'Tab 71'!$A6,'00 CE'!G:G)","v":1160574.8},{"$f":"SUMIF('00 CE'!$B:$B,'Tab 71'!$A6,'00 CE'!F:F)","v":1055569.6099999999},{"$f":"C6-D6","v":105005.19000000018},{"$f":"IF(AND(C6=0,D6=0),0,IF(C6=0,\"\",IF(D6=0,\"\",E6/D6)))","v":9.947727653887288E-2}]
["BA2520","Perdite su crediti",{"$f":"SUMIF('00 CE'!$B:$B,'Tab 71'!$A7,'00 CE'!G:G)","v":0},{"$f":"SUMIF('00 CE'!$B:$B,'Tab 71'!$A7,'00 CE'!F:F)","v":0},{"$f":"C7-D7","v":0},{"$f":"IF(AND(C7=0,D7=0),0,IF(C7=0,\"\",IF(D7=0,\"\",E7/D7)))","v":0}]
["BA2540","Indennità, rimborso spese e oneri sociali per gli Organi Direttivi e Collegio Sindacale",{"$f":"SUMIF('00 CE'!$B:$B,'Tab 71'!$A8,'00 CE'!G:G)","v":1430687.1400000001},{"$f":"SUMIF('00 CE'!$B:$B,'Tab 71'!$A8,'00 CE'!F:F)","v":1434574.81},{"$f":"C8-D8","v":-3887.6699999999255},-2.709980666675672E-3]
["0709030101","Indennità, rimborso spese e oneri sociali per il Direttore Generale",148784.1,171879,{"$f":"C9-D9","v":-23094.899999999994},-0.13436720018152301]
["0709030102","Indennità, rimborso spese e oneri sociali per il Direttore Amministrativo",129339.76,128174,1165.7599999999948,9.0951362990933787E-3]
["0709030103","Indennità, rimborso spese e oneri sociali per il Direttore Sanitario",167495.57,134557,32938.570000000007,0.2447926900867291]
["0709030104","Indennità, rimborso spese e oneri sociali per i membri del Collegio Sindacale",44028.17,45632,-1603.8300000000017,-3.514704593267886E-2]
["0709030105","Indennità, rimborso spese e oneri sociali per i membri delle Commissioni varie",941039.54,954333,-13293.459999999963,-1.3929582231778596E-2]
["BA2550","Altri oneri diversi di gestione",{"$f":"SUMIF('00 CE'!$B:$B,'Tab 71'!$A14,'00 CE'!G:G)","v":292884.42000000004},{"$f":"SUMIF('00 CE'!$B:$B,'Tab 71'!$A14,'00 CE'!F:F)","v":352590.83},{"$f":"C14-D14","v":-59706.409999999974},-0.16933625301599584]
["0709030201","Oneri diversi da decreti ingiuntivi, liti, arbitraggi e risarcimenti",328.09,0,{"$f":"C15-D15","v":328.09},"N/A"]
["0709030202","Oneri diversi derivanti da transazioni",0,15000,{"$f":"C16-D16","v":-15000},"N/A"]
["0709030203","Altri oneri diversi di gestione",292556.33,337591,{"$f":"C17-D17","v":-45034.669999999984},-0.1334000906422268]
[null,"TOTALE",{"$f":"C6+C7+C8+C14","v":2884146.3600000003},{"$f":"D6+D7+D8+D14","v":2842735.25},{"$f":"C18-D18","v":41411.110000000335},1.4567346712994231E-2]
[]
["Altre informazioni relative agli oneri diversi di gestione"]
["Informazione",null,"Caso presente in azienda?",null,"Se sì, illustrare"]
["OG01. Sono state rilevate significative variazioni rispetto all'esercizio precedente? ",null,null,"NO"]

{"sheet":"Punto 23","index":36,"n_rows":32,"n_cols":6,"rows_kept":32,"cut":false,"hidden":false,"merged":[[2,5,3,5],[2,0,3,0],[2,1,3,1],[2,2,3,2],[2,3,3,3],[2,4,3,4],[29,0,29,1],[29,2,29,3],[29,4,29,8],[30,4,30,8],[30,0,31,1],[30,2,31,2],[30,3,31,3],[31,4,31,8]]}
["23.     Accantonamenti"]
[]
["CODICE MOD. CE","DETTAGLIO ACCANTONAMENTI",{"$f":"\"Valore CE \" &'00 Aggregatore'!$F$2","v":"Valore CE 2017"},{"$f":"\"Valore CE \" &'00 Aggregatore'!$F$2-1","v":"Valore CE 2016"},"Variazioni\nimporto","%"]
[]
[null,"Accantonamenti per rischi:",{"$f":"SUM(C6:C10)","v":17301441.66},{"$f":"SUM(D6:D10)","v":6355427.5899999999},{"$f":"C5-D5","v":10946014.07},{"$f":"IF(AND(C5=0,D5=0),0,IF(C5=0,\"\",IF(D5=0,\"\",E5/D5)))","v":1.7223096188245612}]
["BA2710","Accantonamenti per cause civili ed oneri processuali",{"$f":"SUMIF('00 CE'!$B:$B,'Punto 23'!$A6,'00 CE'!G:G)","v":9268206.2400000002},{"$f":"SUMIF('00 CE'!$B:$B,'Punto 23'!$A6,'00 CE'!F:F)","v":2008370.76},7259835.4800000004,{"$f":"IF(AND(C6=0,D6=0),0,IF(C6=0,\"\",IF(D6=0,\"\",E6/D6)))","v":3.6147884766057841}]
["BA2720","Accantonamenti per contenzioso personale dipendente",{"$f":"SUMIF('00 CE'!$B:$B,'Punto 23'!$A7,'00 CE'!G:G)","v":562892.11},{"$f":"SUMIF('00 CE'!$B:$B,'Punto 23'!$A7,'00 CE'!F:F)","v":665916.56999999995},{"$f":"C7-D7","v":-103024.45999999996},-0.15471076204035586]
["BA2730","Accantonamenti per rischi connessi all'acquisto di prestazioni sanitarie da privato",{"$f":"SUMIF('00 CE'!$B:$B,'Punto 23'!$A8,'00 CE'!G:G)","v":4358962},{"$f":"SUMIF('00 CE'!$B:$B,'Punto 23'!$A8,'00 CE'!F:F)","v":0},{"$f":"C8-D8","v":4358962},""]
["BA2740","Accantonamenti per copertura diretta dei rischi (autoassicurazione)",{"$f":"SUMIF('00 CE'!$B:$B,'Punto 23'!$A9,'00 CE'!G:G)","v":3111381.31},{"$f":"SUMIF('00 CE'!$B:$B,'Punto 23'!$A9,'00 CE'!F:F)","v":3681140.26},{"$f":"C9-D9","v":-569758.94999999972},-0.15477784321100543]
["BA2750","Altri accantonamenti per rischi",{"$f":"SUMIF('00 CE'!$B:$B,'Punto 23'!$A10,'00 CE'!G:G)","v":0},{"$f":"SUMIF('00 CE'!$B:$B,'Punto 23'!$A10,'00 CE'!F:F)","v":0},{"$f":"C10-D10","v":0},0]
["BA2760","Accantonamenti per premio di operosità (SUMAI)",{"$f":"SUMIF('00 CE'!$B:$B,'Punto 23'!$A11,'00 CE'!G:G)","v":223015.56},{"$f":"SUMIF('00 CE'!$B:$B,'Punto 23'!$A11,'00 CE'!F:F)","v":225172.71},-2157.1499999999942,-9.5799797408842053E-3]
[null,"Accantonamenti per quote inutilizzate di contributi vincolati:",{"$f":"C13+C14+C15+C16","v":7068429.9500000002},{"$f":"D13+D14+D15+D16","v":4202172.6100000003},2866257.34,0.68208938708969402]
["BA2780","Accantonamenti per quote inutilizzate contributi da Regione e Prov. Aut. per quota F.S. vincolato",{"$f":"SUMIF('00 CE'!$B:$B,'Punto 23'!$A13,'00 CE'!G:G)","v":7018127.5499999998},{"$f":"SUMIF('00 CE'!$B:$B,'Punto 23'!$A13,'00 CE'!F:F)","v":4021566.65},{"$f":"C13-D13","v":2996560.9},0.74512277447894593]
["BA2790","Accantonamenti per quote inutilizzate contributi da soggetti pubblici (extra fondo) vincolati",{"$f":"SUMIF('00 CE'!$B:$B,'Punto 23'!$A14,'00 CE'!G:G)","v":50302.400000000001},{"$f":"SUMIF('00 CE'!$B:$B,'Punto 23'!$A14,'00 CE'!F:F)","v":180605.96},{"$f":"C14-D14","v":-130303.56},-0.72147984485118877]
["BA2800","Accantonamenti per quote inutilizzate contributi da soggetti pubblici per ricerca",{"$f":"SUMIF('00 CE'!$B:$B,'Punto 23'!$A15,'00 CE'!G:G)","v":0},{"$f":"SUMIF('00 CE'!$B:$B,'Punto 23'!$A15,'00 CE'!F:F)","v":0},{"$f":"C15-D15","v":0},0]
["BA2810","Accantonamenti per quote inutilizzate contributi vincolati da privati",{"$f":"SUMIF('00 CE'!$B:$B,'Punto 23'!$A16,'00 CE'!G:G)","v":0},{"$f":"SUMIF('00 CE'!$B:$B,'Punto 23'!$A16,'00 CE'!F:F)","v":0},{"$f":"C16-D16","v":0},0]
[null,"Altri accantonamenti:",{"$f":"SUM(C18:C24)","v":2877740},{"$f":"SUM(D18:D24)","v":1131821},1745919,1.542575195194293]
["BA2830","Accantonamenti per interessi di mora",{"$f":"SUMIF('00 CE'!$B:$B,'Punto 23'!$A18,'00 CE'!G:G)","v":0},{"$f":"SUMIF('00 CE'!$B:$B,'Punto 23'!$A18,'00 CE'!F:F)","v":0},0,0]
["BA2840","Acc. Rinnovi convenzioni MMG/PLS/MCA",{"$f":"SUMIF('00 CE'!$B:$B,'Punto 23'!$A19,'00 CE'!G:G)","v":653733},{"$f":"SUMIF('00 CE'!$B:$B,'Punto 23'!$A19,'00 CE'!F:F)","v":407348},246385,0.60485138014670503]
["BA2850","Acc. Rinnovi convenzioni Medici Sumai",{"$f":"SUMIF('00 CE'!$B:$B,'Punto 23'!$A20,'00 CE'!G:G)","v":82934},{"$f":"SUMIF('00 CE'!$B:$B,'Punto 23'!$A20,'00 CE'!F:F)","v":48849},34085,0.69776249257917256]
["BA2860","Acc. Rinnovi contratt.: dirigenza medica",{"$f":"SUMIF('00 CE'!$B:$B,'Punto 23'!$A21,'00 CE'!G:G)","v":757797},{"$f":"SUMIF('00 CE'!$B:$B,'Punto 23'!$A21,'00 CE'!F:F)","v":278091},479706,1.7249964939534181]
["BA2870","Acc. Rinnovi contratt.: dirigenza non medica",{"$f":"SUMIF('00 CE'!$B:$B,'Punto 23'!$A22,'00 CE'!G:G)","v":74949},{"$f":"SUMIF('00 CE'!$B:$B,'Punto 23'!$A22,'00 CE'!F:F)","v":27505},47444,1.7249227413197601]
["BA2880","Acc. Rinnovi contratt.: comparto",{"$f":"SUMIF('00 CE'!$B:$B,'Punto 23'!$A23,'00 CE'!G:G)","v":1008327},{"$f":"SUMIF('00 CE'!$B:$B,'Punto 23'!$A23,'00 CE'!F:F)","v":370028},638299,1.7250018917487324]
["BA2890","Altri accantonamenti",{"$f":"SUMIF('00 CE'!$B:$B,'Punto 23'!$A24,'00 CE'!G:G)","v":300000},{"$f":"SUMIF('00 CE'!$B:$B,'Punto 23'!$A24,'00 CE'!F:F)","v":0},300000,""]
[null,"Accantonamento al fondo oneri personale in quiescenza ",{"$f":"SUMIF('00 CE'!$B:$B,'Punto 23'!$A25,'00 CE'!G:G)","v":0},{"$f":"SUMIF('00 CE'!$B:$B,'Punto 23'!$A25,'00 CE'!F:F)","v":0},0,0]
[null,"TOTALE",{"$f":"SUM(C25,C17,C12,C11,C5)","v":27470627.170000002},{"$f":"SUM(D25,D17,D12,D11,D5)","v":11914593.91},{"$f":"SUM(E25,E17,E12,E11,E5)","v":15556033.26},1.3056284903628745]
[]
["AC01 - Altri accantonamenti"]
[]
["Informazione",null,"Caso presente in azienda?",null,"Se sì, illustrare"]
["AC01. La voce \"Altri accantonamenti\" è stata movimentata? Se sì, a fronte di quali rischi? ",null,null,"SI"," Nella voce \"Altri accantonamenti\" sono stati contabilizzati, ai sensi dell'art. 9, comma 1, decreto legge n. 203/2005, gli accantonamenti per rinnovi contrattuali sia con riferimento al personale dipendente (per €/000 1.841), sia a favore del personale convenzionato (per €/000 737). Quanto sopra in base alle disposizioni regionali, contenute nelle Linee Guida alla redazione del Bilancio al 31/12/2017, trasmesse con nota prot. n. RA/0108087/DPF012 del 13/04/2018."]
[null,null,null,null,"Tra gli Altri accantonamenti è stato iscritto, inoltre, l'accantonamento al \"Fondo svalutazione altri crediti diversi\" per €/000 300, in quanto a seguito dell'analisi dei crediti iscritti alla voce \"Crediti verso altri\", si è constatato che la riscossione dei crediti risalenti agli esercizi 2009 e retro, di circa €/000 350, procede con estrema lentezza."]

{"sheet":"Commento Accantonamenti","index":37,"n_rows":33,"n_cols":9,"rows_kept":33,"cut":false,"hidden":false,"merged":[[26,0,28,8],[25,0,25,8],[32,0,32,8],[23,0,23,8],[24,0,24,8],[30,0,31,8],[29,0,29,8],[10,8,13,8],[17,0,17,1],[18,0,19,0],[21,0,21,1],[1,0,1,8],[2,0,2,8],[5,0,14,0],[6,6,9,6],[6,7,9,7],[6,8,9,8],[10,6,13,6],[10,7,13,7]]}
["In relazione al Fondo rinnovi contrattuali personale dipendente , si fornisce di seguito il prospetto di dettaglio:"]
[]
["ACCANTONAMENTO  CONSUNTIVO 2017"]
[]
["Codice SP FONDO","conto di coge","Codice CE","Descrizione","  Consuntivo 2015","Accantonamento  dello 1,09%","valore aggregato per codice CE acc","Codice CE accantonamento","Descrizione"]
["PBA230","0715040401","BA2110","Costo personale dirigente medico",69522650,{"$f":"E6*1.09/100","v":757796.88500000001},{"$f":"F6","v":757796.88500000001},"BA2860","Accantonamento rinnovi contrattuali : dirigenza medica"]
[null,"0715040501","BA2150","Costo personale dirigente non medico",5146822,{"$f":"E7*1.09/100","v":56100.359800000006},{"$f":"F7+F8+F9+F10","v":74948.356400000019},"BA2870","Accantonamento rinnovi contrattuali : dirigenza non medica"]
[null,"0715040502","BA2240","Costo personale dirigente ruolo professionale",418139,4557.7151000000003]
[null,"0715040503","BA2330","Costo personale dirigente ruolo tecnico",492897,5372.5772999999999]
[null,"0715040504","BA2420","Costo personale dirigente ruolo amministrativo",818138,8917.7042000000001]
[null,"0715040601","BA2190","Costo personale comparto ruolo sanitario ",66559748,725501.25320000004,{"$f":"F11+F12+F13+F14","v":1008327.3027999999},"BA2880","Accantonamento rinnovi contrattuali : comparto"]
[null,"0715040602","BA2280","Costo personale comparto ruolo  professionale",49814,542.97260000000006]
[null,"0715040603","BA2370","Costo personale comparto ruolo tecnico",16318588,177872.60920000001]
[null,"0715040604","BA2460","Costo personale comparto ruolo amministrativo",9578942,104410.46780000001]
[null,null,null,"totale",{"$f":"SUM(E6:E14)","v":168905738},{"$f":"SUM(F6:F14)","v":1841072.5442000001},{"$f":"SUM(G6:G14)","v":1841072.5441999999}]
[]
["In relazione al Fondo rinnovi convenzioni MMG - PLS - MCA, si fornisce di seguito il prospetto di dettaglio:"]
["Voce",null,"CE consuntivo 2010","quota da accantonare pari a 0,75%","CE consuntivo 2015","Base di calcolo accantonamento  b+c*1,09%","calcolo incremento  del 1,09%","totale da accantonare "]
["BA0420",null,"a","b","c","('d=b+c)","e=d*1,09%","f= b+e"]
[null,"Spese per assistenza MMG",35268675,{"$f":"C20*0.75/100","v":264515.0625},35443596,{"$f":"D20+E20","v":35708111.0625},{"$f":"F20*1.09/100","v":389218.41058125003},{"$f":"D20+G20","v":653733.47308124998}]
["BA0570","Medici Sumai",3878582.33,{"$f":"C21*0.75/100","v":29089.367474999999},4910803,{"$f":"D21+E21","v":4939892.3674750002},{"$f":"F21*1.09/100","v":53844.826805477504},{"$f":"D21+G21","v":82934.194280477503}]
["Totale",null,{"$f":"SUM(C20:C21)","v":39147257.329999998},{"$f":"SUM(D20:D21)","v":293604.42997499998},40354399,40648003.429975003,{"$f":"F22*1.09/100","v":443063.23738672753},{"$f":"D22+G22","v":736667.66736172745}]
[]
["Con riferimento alle somme accantonate al 31/12/2017 si evidenzia quanto segue:"]
["• L'accantonamento al Fondo per cause civili ed oneri processuali (€/000 9.268) deriva dalla stima effettuata dall’Ufficio Affari Legali per passività potenziali connesse al contenzioso giudiziario in corso al 31/12/2017, comunicata con nota prot. n. 0026896/18 del 12/04/2018 ed allegata al presente Bilancio.  "]
["• L'accantonamento al Fondo per contenzioso personale dipendente (€/mln 563), deriva dalla stima effettuata dall’Ufficio Affari Legali, comunicata con nota prot. n. 0026896/18 del 12/04/2018 ed allegata al presente Bilancio.  "]
["• L'accantonamento per copertura diretta dei rischi (auto-assicurazione) si riferisce alle passività potenziali derivanti dalla liquidazione di franchigie previste nel contratto di polizza di rct/o, essendo esso giunto alla conclusione della triennale vigenza contrattuale. Trattasi di somme anticipate dalla Compagnia Assicuratrice  nelle varie annualità di polizza, il cui rimborso viene chiesto successivamente alla contraente azienda. L'accantonamento rilevato nel 2017 deriva dalla stima effettuata dall'Ufficio Affari Legali, comunicata con nota prot. n. 0026896/18 del 12/04/2018 ed allegata al presente Bilancio.    "]
[]
[]
["• Al 31/12/2017 non sono state accantonate somme per rischi connessi all'acquisto di prestazioni sanitarie da privato accreditato, in quanto nel corrente esercizio non sono state iscritte in bilancio note di credito da ricevere.  "]
["• la somma di €/000 7.068, contabilizzata nella voce “Accantonamenti per quote inutilizzate di contributi vincolati”, corrisponde alle quote non utilizzate di contributi da Regione o Prov. Aut. per quota F.S. vincolato (€/000 7.018) e da soggetti pubblici extra fondo vincolati (€/000 50), contabilizzate a fondo come da specifiche istruzioni regionali contenute nelle Linee guida alla redazione del bilancio di esercizio 2017, trasmesse con nota prot. n. RA/0108087/DPF012 del 13/04/2018. "]
[]
["• In relazione alla voce \"Altri Accantonamenti\", si rinvia a quanto già evidenziato nei commenti alla pagina precedente. "]

{"sheet":"Punti 24-25","index":38,"n_rows":18,"n_cols":5,"rows_kept":18,"cut":false,"hidden":false,"merged":[[0,0,0,3],[2,0,2,1],[2,2,2,3],[2,4,2,7],[3,0,3,1],[3,4,3,7],[17,0,17,1],[17,4,17,5],[4,0,4,1],[4,4,4,7],[11,0,11,1],[16,0,16,1],[16,2,16,3],[16,4,16,5]]}
["24.  Proventi e oneri finanziari"]
[]
["Informazione",null,"Caso presente in azienda?",null,"Se sì, illustrare"]
["OF01. Sono state rilevate significative variazioni rispetto all'esercizio precedente? ",null,"SI",null,"Nell'esercizio 2017 l'Azienda non ha conseguito proventi finanziari.Gli oneri finanziari, dettagliati nella tabella sottostante, hanno subito un incremento di circa €/000 136, relativo perlopiù ad interessi moratori nei confronti della casa di Cura Synergo, in relazione a fatture in contestazione. "]
["OF02. Nell'esercizio sono stati sostenuti oneri finanziari? Se sì, da quale operazione derivano? ",null,"SI",null,"Gli oneri finanziari contabilizzati nel 2017 sono principalmente rappresentati da interessi di mora su debiti commerciali. "]
[]
["Oneri finanziari"]
["Cod. Conto","Descrizione","Importo"]
["0801030101","Interessi moratori",157753.12]
["0801030102","Altri interessi passivi",73.63]
["0802010101","Altri oneri finanziari",4522.33]
["TOTALE",null,{"$f":"SUM(C9:C11)","v":162349.07999999999}]
[]
[]
["25. Rettifiche di valore di attività finanziarie"]
[]
["Informazione",null,"Caso presente in azienda?",null,"Se sì, illustrare"]
["RF01. Nell'esercizio sono state rilevate rettifiche di valore di attività finanziarie? ",null,null,"NO"]

{"sheet":"Punto 26","index":39,"n_rows":14,"n_cols":5,"rows_kept":14,"cut":false,"hidden":false,"merged":[[13,0,14,8],[1,0,1,3],[7,0,7,1],[7,2,7,3],[8,0,8,1],[8,4,8,8],[7,4,7,8]]}
[]
["26. Proventi e oneri straordinari"]
[]
["PS01 - Plusvalenze/Minusvalenze"]
[]
[]
[]
["Informazione",null,"Caso presente in azienda?",null,"Se sì, illustrare"]
["PS01. Nell'esercizio sono state rilevate plusvalenze/minusvalenze? ",null,null,"NO","Nel corso del 2017 non sono state rilevate plusvalenze/minusvalenze.  "]
[]
[]
[]
[]
["Nel corso dell'esercizio 2017 non sono stati ceduti beni acquistati con contributi in c/capitale. "]

{"sheet":"PS02-03-04-05","index":40,"n_rows":103,"n_cols":10,"rows_kept":103,"cut":false,"hidden":false,"merged":[[12,0,12,9],[13,0,13,9],[33,0,33,9],[15,0,15,9],[9,0,9,1],[14,0,14,9],[61,0,61,9],[57,0,57,9],[58,0,58,9],[16,0,16,9],[17,0,17,9],[60,0,60,9],[59,0,59,9],[34,0,34,9],[18,0,18,9],[19,0,19,9],[30,0,30,1],[35,0,35,9],[54,0,54,1],[62,0,62,9],[63,0,63,9],[64,0,64,9],[65,0,65,9],[95,0,95,1],[97,0,98,9],[99,0,101,9],[102,0,102,9],[66,0,66,9],[67,0,67,9],[68,0,68,9],[69,0,69,9]]}
[]
["PS02 - Sopravvenienze attive"]
[]
["Conto","Descrizione Conto","Anni 2010 e precedenti","Anno 2011","Anno 2012","Anno 2013","Anno 2014","Anno 2015","Anno 2016","Valore al 31/12/2017"]
["0601020201","Sopravvenienze attive v/Aziende sanitarie pubbliche della Regione relative alla mobilità intraregionale",0,0,0,0,0,0,1937686,{"$f":"SUM(C5:I5)","v":1937686}]
["0601020202","Altre sopravvenienze attive v/Aziende sanitarie pubbliche della Regione",0,0,0,0,0,17724.66,94041.600000000006,{"$f":"SUM(C6:I6)","v":111766.26000000001}]
["0601020207","Sopravvenienze attive v/terzi relative all'acquisto prestazioni sanitarie da operatori accreditati",0,0,0,0,2511074.2400000002,0,488778.49,2999852.7300000004]
["0601020208","Sopravvenienze attive v/terzi relative all'acquisto di beni e servizi",398,0,0,0,0,11336.36,329561.42,341295.77999999997]
["0601020210","Altre sopravvenienze attive v/terzi",0,0,0,0,5252.78,6019.5,1999386.65,2010658.93]
["TOTALE SOPRAVVENIENZE ATTIVE",null,{"$f":"SUM(C5:C9)","v":398},0,0,0,2516327.02,35080.520000000004,4849454.16,{"$f":"SUM(C10:I10)","v":7401259.7000000002}]
[]
[]
["Sopravvenienze attive v/ASL della Regione relative alla mobilità intraregionale: l’importo di €/000 1.938 è dato dal conguaglio della mobilità  passiva intraregionale da pubblico 2016 per €/000 130 e della mobilità attiva intraregionale da pubblico 2016 per €/000 1.807, come da comunicazione regionale nota n. RA/0108087/DPF012  del 13/04/2018."]
["Altre sopravvenienze attive v/ASL della Regione: la voce, che ammonta a €/000 112, accoglie  le sopravvenienze attive relative a fatture emesse nei confronti delle  Aziende Sanitarie Regionali per prestazioni rese negli esercizi 2015/2016. "]
["Sopravvenienze attive v/terzi relative all'acquisto prestazioni sanitarie da operatori accreditati: il saldo (€/000 2.999) accoglie, per €/000 1.840, la nota di credito emessa dalla struttura Villa Serena per extrabudget realizzato nell'anno 2014 e per €/000 655 l'importo delle note di credito ricevute dalla struttura Prov. Relig. SS. Apostoli Pietro e Paolo per extrabudget 2013 e 2014. Per queste ultime, negli esercizi di competenza, a fronte del superamento del budget, l'Azienda aveva rilevato in contabilità l'importo delle note di credito da ricevere e l'accantonamento al Fondo rischi di non emissione delle stesse. Nell'esercizio 2017, essendo pervenute tali note di credito, l'Azienda ha stornato il Fondo rischi, rilevando una sopravvenienza attiva di pari importo. Per il resto, il conto accoglie importi meno significativi, relativi a note di credito emesse da strutture convenzionate per extrabudget anni 2014-2016 e a note di credito emesse a seguito di verbali di verifica per prestazioni rese in precedenti esercizi. "]
["Sopravvenienze attive verso terzi – relative all’acquisto di beni e servizi: la voce (€/000 341) si compone di piccoli importi ed accoglie le note di credito emesse da ditte varie per la fornitura di beni e servizi, a storno di fatture emesse negli esercizi precedenti.  "]
["Sopravvenienze attive verso terzi – altre sopravvenienze attive: la voce accoglie tutte le altre sopravvenienze attive (per €/000 2.010), diverse da quelle classificate nelle restanti voci. In particolare, vi sono contabilizzate: "]
["• le sopravvenienze attive relative al Pay-back 2016 per complessivi €/000 1.597, come da indicazioni contenute nelle Linee Guida Regionali alla redazione del Bilancio 2017 (Allegato 4 alla nota prot. n. RA/0108087/DPF012 del 13/04/2018;"]
["• recupero IRAP disabili 2016 Modello UNICO 2017 per €/000 289;"]
["• altre rilevazioni di importo minore."]
[]
[]
[]
[]
["PS03 - Insussistenze attive"]
[]
["Conto","Descrizione Conto","Anni 2010 e precedenti","Anno 2011","Anno 2012","Anno 2013","Anno 2014","Anno 2015","Anno 2016","Valore al 31/12/2017"]
["0601020306","Insussistenze attive verso terzi - relative all' acquisto di prestazioni sanitarie da operatori accreditati",1593954.33,0,0,13830,22090,33487.760000000002,9041.82,{"$f":"SUM(C28:I28)","v":1672403.9100000001}]
["0601020307","Insussistenze attive verso terzi - relative all' acquisto di beni e servizi",189846.13,0,0,0,1270.5,51271.03,45857.51,288245.17]
["0601020308"," Altre insussistenze attive v/terzi",0,0,0,0,0,1168.81,124071.26,125240.06999999999]
["TOTALE INSUSSISTENZE ATTIVE",null,{"$f":"SUM(C28:C30)","v":1783800.46},{"$f":"SUM(D28:D30)","v":0},0,13830,23360.5,85927.6,178970.59,2085889.1500000001]
[]
[]
["Insussistenze attive verso terzi – relative all’acquisto di prestazioni sanitarie da operatori accreditati: la voce, che ammonta ad €/000 1.672, accoglie prevalentemente le insussistenze attive derivanti dalla chiusura di debiti v/strutture private accreditate, che risultano prescritti, come comunicato dalle strutture aziendali competenti o da sentenza del Tribunale o da rinuncia al credito da parte del fornitore. Le somme di cui trattasi, per circa €/000 1.593, sono rinvenienti dallo storno del fondo rischi appositamente accantonato nei periodi di riferimento. "]
["Insussistenze attive verso terzi – relative all’acquisto di beni e servizi: la voce, che ammonta ad €/000 288, accoglie le insussistenze attive derivanti dalla chiusura di debiti v/fornitori per l'acquisto di beni e servizi, che risultano prescritti, come comunicato dalle strutture aziendali competenti o a seguito di rinuncia al credito da parte del fornitore. L'importo più significativo è dato dalla chiusura della fattura per addebito di interessi di mora 2007 emessa dalla ditta Omnia Servitia per €/000 131. "]
["Insussistenze attive verso terzi – altre insussistenze attive verso terzi: la voce ammonta a €/000 125, ed accoglie altre insussistenze attive di debiti non dovuti a vario titolo. Il saldo si compone di importi di rilevanza non significativa."]
[]
[]
[]
[]
[]
["PS04 - Sopravvenienze passive"]
[]
[]
[]
["Conto","Descrizione Conto","Anni 2010 e precedenti","Anno 2011","Anno 2012","Anno 2013","Anno 2014","Anno 2015","Anno 2016","Valore al 31/12/2017"]
[1001020302,"Altre sopravvenienze passive v/Aziende sanitarie pubbliche della Regione",0,0,0,0,0,0,134078.51,{"$f":"SUM(C47:I47)","v":134078.51}]
[1001020304,"Sopravvenienze passive v/terzi relative al personale - dirigenza medica",0,0,0,0,0,0,183240.74,183240.74]
["1001020305","Sopravvenienze passive v/terzi relative al personale - dirigenza non medica",0,0,0,0,0,0,5333.38,5333.38]
[1001020306,"Sopravvenienze passive v/terzi relative al personale - comparto",0,0,0,0,0,0,363166.05,363166.05]
[1001020308,"Sopravvenienze passive v/terzi relative alle convenzioni con la specialistica",0,0,0,0,0,0,48576.12,48576.12]
[1001020309,"Sopravvenienze passive v/terzi relative all'acquisto prestazioni sanitarie da operatori accreditati",0,0,0,0,15817.09,0,9465.2000000000007,25282.29]
["1001020310","Sopravvenienze passive v/terzi relative all'acquisto di beni e servizi",0,0,2296.89,11754.39,11423.1,21986.25,2603805.2200000002,2651265.85]
["1001020312","Altre sopravvenienze passive v/terzi",464.82,0,0,0,0,23.37,133906.99,134395.18]
["TOTALE SOPRAVVENIENZE PASSIVE",null,{"$f":"SUM(C47:C54)","v":464.82},0,2296.89,11754.39,27240.190000000002,22009.62,3481572.21,{"$f":"SUM(C55:I55)","v":3545338.12}]
[]
[]
["Sopravvenienze passive v/Aziende sanitarie pubbliche della Regione: la voce, che ammonta a €/000 134, accoglie  le sopravvenienze passive relative a fatture emesse dalla ASL di Teramo e riferite a prestazioni specialistiche erogate nel precedente esercizio, non registrate nel periodo di competenza in quanto pervenute nel 2017."]
["Sopravvenienze passive v/terzi relative al personale – dirigenza medica: la voce, di importo pari a €/000 183, accoglie le sopravvenienze passive per arretrati (competenze e IRAP) di competenza di esercizi precedenti e non rilevati, spettanti alla dirigenza medica. La parte prevalente delle sopravvenienze in parola è attribuibile al pagamento di alcune indennità (indennità di esclusività rapporto ed altro ) riconosciute ex post . "]
["Sopravvenienze passive v/terzi relative al personale – dirigenza non medica: la voce, di importo pari a €/000 5, accoglie le sopravvenienze passive per arretrati (competenze e IRAP) di competenza di esercizi precedenti e non rilevati, spettanti alla dirigenza non medica. "]
["Sopravvenienze passive v/terzi relative al personale – personale comparto: la voce, di importo pari a €/000 363, accoglie le sopravvenienze passive per arretrati (competenze e IRAP) di competenza di esercizi precedenti e non rilevati, spettanti al personale del comparto."]
["Sopravvenienze passive verso terzi - relative alle convenzioni con la specialistica: l'importo accoglie la rilevazione di somme relative ad esercizi precedenti liquidate a seguito di una sentenza di dicembre 2016 a medici specialisti ambulatoriali interni."]
[" Sopravvenienze passive v/terzi relative all’acquisto di prestazioni sanitarie da operatori accreditati: la voce accoglie le fatture emesse da operatori sanitari accreditati relative a prestazioni sanitarie di varia natura erogate negli anni precedenti, non registrate negli esercizi di competenza. Il saldo si compone di importi poco significativi."]
["Sopravvenienze passive v/terzi relative all’acquisto di beni e servizi: la voce in esame, che ammonta complessivamente a €/000 2.651, accoglie diverse fatture pervenute nell'esercizio, emesse da ditte varie a fronte di forniture di beni e servizi avvenute negli anni precedenti e non registrate nell’esercizio di competenza. Gli importi più significativi sono:"]
["- €/000 1.400, relativi al conguaglio per la fornitura di acqua dalla società ACA Spa esercizi 2014/2015/2016; "]
["- €/000 239, relativi ad interessi di competenza di esercizi precedenti, fatturati dalla struttura San Raffaele Spa;   "]
["- €/000 167,  relativi a prestazioni didialisi mesi Novembre e Dicembre 2016, fatturate dalla ditta Diaverum Italia; "]
["- €/000 102, per conguaglio 2016 servizio di sanificazione fatturato da Dussmann Service Srl; "]
["- €/000 97, relativi al conguaglio II semestre 2016 per il servizio di lavanolo fatturato dalla ditta Servizi Ospedalieri."]
["Sopravvenienze passive v/terzi – altre sopravvenienze passive: la voce, che ammonta ad €/000 134, accoglie  altre sopravvenienze passive, diverse da quelle classificate nelle precedenti voci. Il saldo comprende, per €/000 63 il saldo IRES 2016 da Modello Unico 2017.\n"]
[]
[]
[]
[]
[]
[]
[]
[]
[]
[]
[]
[]
[]
[]
[]
[]
[]
[]
[]
["PS05 - Insussistenze passive"]
[]
["Conto","Descrizione Conto","Anni 2010 e precedenti","Anno 2011","Anno 2012","Anno 2013","Anno 2014","Anno 2015","Anno 2016","Valore al 31/12/2017"]
[1001020406,"Insussistenze passive v/terzi relative all'acquisto prestazioni sanitarie da operatori accreditati",1286.3699999999999,0,0,0,8,4,831022.25,{"$f":"SUM(C93:I93)","v":832320.62}]
["1001020407","Insussistenze passive v/terzi relative all'acquisto di beni e servizi",111048.21,0,0,1027.4000000000001,0,110.28,3177.38,{"$f":"SUM(C94:I94)","v":115363.27}]
["1001020408","Altre insussistenze passive v/terzi",11.91,833.09,1137.81,1959.87,910.08,6704.87,65020.44,76578.070000000007]
["TOTALE INSUSSISTENZE PASSIVE",null,{"$f":"SUM(C93:C95)","v":112346.49},833.09,1137.81,2987.27,918.08,6819.15,899220.07000000007,1024261.9600000001]
[]
["Insussistenze passive v/terzi relative all’acquisto di prestazioni sanitarie da operatori accreditati: la voce, che ammonta a €/000 832, accoglie la rilevazione della chiusura di note di credito da ricevere da operatori accreditati dichiarati insussistenti. L'importo più significativo, pari ad €/000 821, è una rettifica del valore iscritto in COGE delle note di credito da ricevere, a seguito di tre note di credito emesse da Villa Serena e registrate solo a rettifica del costo e non a riduzione del saldo delle note di credito da ricevere. "]
[]
["Insussistenze passive v/terzi relative all’acquisto di beni e servizi: la voce, che ammonta a €/000 115, accoglie la rilevazione della chiusura di documenti dichiarati insussistenti. L'importo più rilevante, di €/000 111, si riferisce ad una nota di credito emessa dalla ditta Omnia Servitia per interessi moratori di competenza del 2007, emessa a storno parziale di una fatturaper addebito degli interessi di mora, anch'essa chiusa come insussistenza attiva."]
[]
[]
["Insussistenze passive v/terzi – altre insussistenze passive: la voce, di importo pari ad €/000 77, accoglie la rilevazione della chiusura di documenti dichiarati insussistenti per errate registrazioni e per furti. Il saldo si compone di importi poco significativi. "]

{"sheet":"PS06","index":41,"n_rows":29,"n_cols":7,"rows_kept":29,"cut":false,"hidden":false,"merged":[[0,0,0,5],[2,0,2,3],[2,4,2,5],[6,0,6,4],[3,0,4,3],[3,4,4,4],[3,5,4,5],[2,6,2,10],[21,4,25,4],[25,0,25,1],[20,3,20,4],[8,3,8,4],[9,4,13,4],[13,0,13,1],[18,0,18,4],[3,6,4,10]]}
["Altre informazioni"]
[]
["Informazione",null,null,null,"Caso presente in azienda?",null,"Se sì, illustrare"]
["PS06. Esistono altre informazioni che si ritiene necessario fornire per soddisfare la regola generale secondo cui \"Se le informazioni richieste da specifiche disposizioni di legge non sono sufficienti a dare una rappresentazione veritiera e corretta, si devono fornire le informazioni complementari necessarie allo scopo\" (art. 2423 CC)? ",null,null,null,null,"NO"]
[]
[]
["TABELLA DI RACCORDO - DETTAGLIO PROVENTI STRAORDINARI"]
[]
["Voce CE","Descrizione","Valore","Voce CE IV Dir."]
["EA0050","Totale sopravvenienze attive",7401259.7000000002,"a","E 1) b)"]
["EA0150","Totale insussistenze attive",2085889.15,"b"]
["EA0040","Proventi da donazioni e liberalità diverse",0]
["EA0250","Altri proventi straordinari",0]
["TOTALE Altri proventi straordinari",null,{"$f":"SUM(C10:C13)","v":9487148.8499999996}]
[]
["a","Totale Tabella PS 02 Nota Integrativa"]
["b","Totale Tabella PS 03 Nota Integrativa"]
[]
["TABELLA DI RACCORDO - DETTAGLIO ONERI STRAORDINARI"]
[]
["Voce CE","Descrizione","Valore","Voce CE IV Dir."]
["EA0310","Totale sopravvenienze passive",3545337.72,"c","E 2) b)"]
["EA0460","Totale insussistenze passive",1024261.96,"d"]
["EA0300","Oneri da cause civili ed oneri processuali",0]
["EA0560","Altri oneri straordinari",0]
["TOTALE Altri oneri straordinari",null,{"$f":"SUM(C22:C25)","v":4569599.68}]
[]
["c","Totale Tabella PS 04 Nota Integrativa"]
["d","Totale Tabella PS 05 Nota Integrativa"]

{"sheet":"PS07","index":42,"n_rows":0,"n_cols":0,"rows_kept":0,"cut":false,"hidden":false,"merged":[]}

{"sheet":"Foglio1","index":43,"n_rows":0,"n_cols":0,"rows_kept":0,"cut":false,"hidden":false,"merged":[]}